{"text_format":"1","workbook":"xlsx","n_sheets":17,"sheets":["TOTALS-LS-BKP","PRIMARY INFORMATION","ENTRY SHEET","6-8-MDMonthly","6-8-EGG BILL","9-10-MDM&EGG","RICE ACCOUNT","TOTALS-LS","TOTALS-LS (2)","MONTHLY","PRINTS==>","RICE ACCOUNT-BKP","9-10-BKP","QUARTERLY","UPSBILL","HSSBILL","RICE BALANC"],"not_rendered":{"charts":0,"images":0,"macros":1,"external_links":1,"defined_names":36,"comments":0,"pivot_tables":0},"unopened":[],"bounds":{"document_bytes":16777216,"sheet_cells":100000,"rows_first":2000,"rows_last":500,"rows_between":2000,"halvings":0,"cell_chars":16384,"cell_head_chars":4096},"cells_cut":0,"cells_raw":0,"read":"whole","date_system":"1900"}

{"sheet":"TOTALS-LS-BKP","index":0,"n_rows":59,"n_cols":27,"rows_kept":59,"cut":false,"hidden":true,"merged":[[40,20,40,23],[40,24,40,26],[2,5,2,7],[2,9,2,11],[2,13,2,14],[2,16,2,17],[40,5,40,7],[40,9,40,11],[40,13,40,17],[40,0,40,3],[0,0,0,25],[1,2,1,7],[1,11,1,17],[1,20,1,21],[1,23,1,25],[2,19,2,21],[2,23,2,25],[4,0,4,13],[4,19,4,21],[39,0,39,3],[39,5,39,7],[39,9,39,11],[39,13,39,17],[39,24,39,26],[2,1,2,3]]}
["MID-DAY MEALS PROGRAMME"]
["MANDAL",null,{"$f":"MANDAL","v":"XYZ"},null,null,null,null,null,null,"SCHOOL",null,{"$f":"SCHOOL","v":"ZPHS ABC"},null,null,null,null,null,null,null,null,"MONTH",null,null,{"$f":"MONTH","v":43831},null,null,{"$f":"MONTH","v":43831}]
["DATE","ENROLLED",null,null,null,"PRSENT",null,null,null,"MDM TAKEN",null,null,null,"UPS RICE",null,null,"HS RICE",null,null,"AMOUNT",null,null,null,"RICE RECEIVED",null,null,"MENU"]
[null,"UPS","HS","TOTAL",null,"UPS","HS","TOTAL",null,"UPS","HS","TOTAL",null,"GIVEN","BALANCE",null,"GIVEN","BALANCE",null,"UPS","HS","TOTAL",null,"UPS","HS","TOTAL"]
["LAST MONTH RICE BALANCE ------->",null,null,null,null,null,null,null,null,null,null,null,null,null,{"$f":"'RICE ACCOUNT'!$B$6","v":120},null,null,{"$f":"'RICE ACCOUNT'!$C$6","v":110},null,"@6.00"]
[1,{"$f":"#REF!","v":{"$error":"#REF!"}},{"$f":"'9-10-MDM&EGG'!C5","v":155},{"$f":"SUM(B6:C6)","v":{"$error":"#REF!"}},null,{"$f":"#REF!","v":{"$error":"#REF!"}},{"$f":"'9-10-MDM&EGG'!D5","v":0},{"$f":"SUM(F6:G6)","v":{"$error":"#REF!"}},null,{"$f":"#REF!","v":{"$error":"#REF!"}},{"$f":"'9-10-MDM&EGG'!E5","v":0},{"$f":"SUM(J6:K6)","v":{"$error":"#REF!"}},null,{"$f":"J6*150/1000","v":{"$error":"#REF!"}},{"$f":"'RICE ACCOUNT'!N6","v":120},null,{"$f":"K6*150/1000","v":0},{"$f":"'RICE ACCOUNT'!O6","v":110},null,{"$f":"J6*6","v":{"$error":"#REF!"}},{"$f":"K6*6","v":0},{"$f":"SUM(T6:U6)","v":{"$error":"#REF!"}},null,{"$f":"'RICE ACCOUNT'!F6","v":0},{"$f":"'RICE ACCOUNT'!G6","v":0},{"$f":"SUM(X6:Y6)","v":0}]
["a",{"$f":"#REF!","v":{"$error":"#REF!"}},{"$f":"'9-10-MDM&EGG'!C6","v":155},{"$f":"SUM(B7:C7)","v":{"$error":"#REF!"}},null,{"$f":"#REF!","v":{"$error":"#REF!"}},{"$f":"'9-10-MDM&EGG'!D6","v":0},{"$f":"SUM(F7:G7)","v":{"$error":"#REF!"}},null,{"$f":"#REF!","v":{"$error":"#REF!"}},{"$f":"'9-10-MDM&EGG'!E6","v":0},{"$f":"SUM(J7:K7)","v":{"$error":"#REF!"}},null,{"$error":"#REF!"},{"$f":"'RICE ACCOUNT'!N7","v":120},null,0,{"$f":"'RICE ACCOUNT'!O7","v":110},null,{"$f":"J7*6","v":{"$error":"#REF!"}},0,{"$f":"SUM(T7:U7)","v":{"$error":"#REF!"}},null,{"$f":"'RICE ACCOUNT'!F7","v":0},{"$f":"'RICE ACCOUNT'!G7","v":0},{"$f":"SUM(X7:Y7)","v":0}]
[3,{"$f":"#REF!","v":{"$error":"#REF!"}},{"$f":"'9-10-MDM&EGG'!C7","v":155},{"$error":"#REF!"},null,{"$f":"#REF!","v":{"$error":"#REF!"}},{"$f":"'9-10-MDM&EGG'!D7","v":0},{"$error":"#REF!"},null,{"$f":"#REF!","v":{"$error":"#REF!"}},{"$f":"'9-10-MDM&EGG'!E7","v":0},{"$error":"#REF!"},null,{"$error":"#REF!"},{"$f":"'RICE ACCOUNT'!N8","v":120},null,0,{"$f":"'RICE ACCOUNT'!O8","v":110},null,{"$error":"#REF!"},0,{"$error":"#REF!"},null,{"$f":"'RICE ACCOUNT'!F8","v":0},{"$f":"'RICE ACCOUNT'!G8","v":0},0]
[4,{"$f":"#REF!","v":{"$error":"#REF!"}},{"$f":"'9-10-MDM&EGG'!C8","v":155},{"$error":"#REF!"},null,{"$f":"#REF!","v":{"$error":"#REF!"}},{"$f":"'9-10-MDM&EGG'!D8","v":0},{"$error":"#REF!"},null,{"$f":"#REF!","v":{"$error":"#REF!"}},{"$f":"'9-10-MDM&EGG'!E8","v":0},{"$error":"#REF!"},null,{"$error":"#REF!"},{"$f":"'RICE ACCOUNT'!N9","v":120},null,0,{"$f":"'RICE ACCOUNT'!O9","v":110},null,{"$error":"#REF!"},0,{"$error":"#REF!"},null,{"$f":"'RICE ACCOUNT'!F9","v":0},{"$f":"'RICE ACCOUNT'!G9","v":0},0]
[5,{"$f":"#REF!","v":{"$error":"#REF!"}},{"$f":"'9-10-MDM&EGG'!C9","v":155},{"$error":"#REF!"},null,{"$f":"#REF!","v":{"$error":"#REF!"}},{"$f":"'9-10-MDM&EGG'!D9","v":0},{"$error":"#REF!"},null,{"$f":"#REF!","v":{"$error":"#REF!"}},{"$f":"'9-10-MDM&EGG'!E9","v":0},{"$error":"#REF!"},null,{"$error":"#REF!"},{"$f":"'RICE ACCOUNT'!N10","v":120},null,0,{"$f":"'RICE ACCOUNT'!O10","v":110},null,{"$error":"#REF!"},0,{"$error":"#REF!"},null,{"$f":"'RICE ACCOUNT'!F10","v":0},{"$f":"'RICE ACCOUNT'!G10","v":0},0]
[6,{"$f":"#REF!","v":{"$error":"#REF!"}},{"$f":"'9-10-MDM&EGG'!C10","v":155},{"$error":"#REF!"},null,{"$f":"#REF!","v":{"$error":"#REF!"}},{"$f":"'9-10-MDM&EGG'!D10","v":0},{"$error":"#REF!"},null,{"$f":"#REF!","v":{"$error":"#REF!"}},{"$f":"'9-10-MDM&EGG'!E10","v":0},{"$error":"#REF!"},null,{"$error":"#REF!"},{"$f":"'RICE ACCOUNT'!N11","v":120},null,0,{"$f":"'RICE ACCOUNT'!O11","v":110},null,{"$error":"#REF!"},0,{"$error":"#REF!"},null,{"$f":"'RICE ACCOUNT'!F11","v":0},{"$f":"'RICE ACCOUNT'!G11","v":0},0]
[7,{"$f":"#REF!","v":{"$error":"#REF!"}},{"$f":"'9-10-MDM&EGG'!C11","v":155},{"$error":"#REF!"},null,{"$f":"#REF!","v":{"$error":"#REF!"}},{"$f":"'9-10-MDM&EGG'!D11","v":0},{"$error":"#REF!"},null,{"$f":"#REF!","v":{"$error":"#REF!"}},{"$f":"'9-10-MDM&EGG'!E11","v":0},{"$error":"#REF!"},null,{"$error":"#REF!"},{"$f":"'RICE ACCOUNT'!N12","v":120},null,0,{"$f":"'RICE ACCOUNT'!O12","v":110},null,{"$error":"#REF!"},0,{"$error":"#REF!"},null,{"$f":"'RICE ACCOUNT'!F12","v":0},{"$f":"'RICE ACCOUNT'!G12","v":0},0]
[8,{"$f":"#REF!","v":{"$error":"#REF!"}},{"$f":"'9-10-MDM&EGG'!C12","v":155},{"$error":"#REF!"},null,{"$f":"#REF!","v":{"$error":"#REF!"}},{"$f":"'9-10-MDM&EGG'!D12","v":0},{"$error":"#REF!"},null,{"$f":"#REF!","v":{"$error":"#REF!"}},{"$f":"'9-10-MDM&EGG'!E12","v":0},{"$error":"#REF!"},null,{"$error":"#REF!"},{"$f":"'RICE ACCOUNT'!N13","v":120},null,0,{"$f":"'RICE ACCOUNT'!O13","v":110},null,{"$error":"#REF!"},0,{"$error":"#REF!"},null,{"$f":"'RICE ACCOUNT'!F13","v":0},{"$f":"'RICE ACCOUNT'!G13","v":0},0]
[9,{"$f":"#REF!","v":{"$error":"#REF!"}},{"$f":"'9-10-MDM&EGG'!C13","v":155},{"$error":"#REF!"},null,{"$f":"#REF!","v":{"$error":"#REF!"}},{"$f":"'9-10-MDM&EGG'!D13","v":0},{"$error":"#REF!"},null,{"$f":"#REF!","v":{"$error":"#REF!"}},{"$f":"'9-10-MDM&EGG'!E13","v":0},{"$error":"#REF!"},null,{"$error":"#REF!"},{"$f":"'RICE ACCOUNT'!N14","v":120},null,0,{"$f":"'RICE ACCOUNT'!O14","v":110},null,{"$error":"#REF!"},0,{"$error":"#REF!"},null,{"$f":"'RICE ACCOUNT'!F14","v":0},{"$f":"'RICE ACCOUNT'!G14","v":0},0]
[10,{"$f":"#REF!","v":{"$error":"#REF!"}},{"$f":"'9-10-MDM&EGG'!C14","v":155},{"$error":"#REF!"},null,{"$f":"#REF!","v":{"$error":"#REF!"}},{"$f":"'9-10-MDM&EGG'!D14","v":0},{"$error":"#REF!"},null,{"$f":"#REF!","v":{"$error":"#REF!"}},{"$f":"'9-10-MDM&EGG'!E14","v":0},{"$error":"#REF!"},null,{"$error":"#REF!"},{"$f":"'RICE ACCOUNT'!N15","v":120},null,0,{"$f":"'RICE ACCOUNT'!O15","v":110},null,{"$error":"#REF!"},0,{"$error":"#REF!"},null,{"$f":"'RICE ACCOUNT'!F15","v":0},{"$f":"'RICE ACCOUNT'!G15","v":0},0]
[11,{"$f":"#REF!","v":{"$error":"#REF!"}},{"$f":"'9-10-MDM&EGG'!C15","v":155},{"$error":"#REF!"},null,{"$f":"#REF!","v":{"$error":"#REF!"}},{"$f":"'9-10-MDM&EGG'!D15","v":0},{"$error":"#REF!"},null,{"$f":"#REF!","v":{"$error":"#REF!"}},{"$f":"'9-10-MDM&EGG'!E15","v":0},{"$error":"#REF!"},null,{"$error":"#REF!"},{"$f":"'RICE ACCOUNT'!N16","v":120},null,0,{"$f":"'RICE ACCOUNT'!O16","v":110},null,{"$error":"#REF!"},0,{"$error":"#REF!"},null,{"$f":"'RICE ACCOUNT'!F16","v":0},{"$f":"'RICE ACCOUNT'!G16","v":0},0]
[12,{"$f":"#REF!","v":{"$error":"#REF!"}},{"$f":"'9-10-MDM&EGG'!C16","v":155},{"$error":"#REF!"},null,{"$f":"#REF!","v":{"$error":"#REF!"}},{"$f":"'9-10-MDM&EGG'!D16","v":0},{"$error":"#REF!"},null,{"$f":"#REF!","v":{"$error":"#REF!"}},{"$f":"'9-10-MDM&EGG'!E16","v":0},{"$error":"#REF!"},null,{"$error":"#REF!"},{"$f":"'RICE ACCOUNT'!N17","v":120},null,0,{"$f":"'RICE ACCOUNT'!O17","v":110},null,{"$error":"#REF!"},0,{"$error":"#REF!"},null,{"$f":"'RICE ACCOUNT'!F17","v":0},{"$f":"'RICE ACCOUNT'!G17","v":0},0]
[13,{"$f":"#REF!","v":{"$error":"#REF!"}},{"$f":"'9-10-MDM&EGG'!C17","v":155},{"$error":"#REF!"},null,{"$f":"#REF!","v":{"$error":"#REF!"}},{"$f":"'9-10-MDM&EGG'!D17","v":0},{"$error":"#REF!"},null,{"$f":"#REF!","v":{"$error":"#REF!"}},{"$f":"'9-10-MDM&EGG'!E17","v":0},{"$error":"#REF!"},null,{"$error":"#REF!"},{"$f":"'RICE ACCOUNT'!N18","v":120},null,0,{"$f":"'RICE ACCOUNT'!O18","v":110},null,{"$error":"#REF!"},0,{"$error":"#REF!"},null,{"$f":"'RICE ACCOUNT'!F18","v":0},{"$f":"'RICE ACCOUNT'!G18","v":0},0]
[14,{"$f":"#REF!","v":{"$error":"#REF!"}},{"$f":"'9-10-MDM&EGG'!C18","v":155},{"$error":"#REF!"},null,{"$f":"#REF!","v":{"$error":"#REF!"}},{"$f":"'9-10-MDM&EGG'!D18","v":0},{"$error":"#REF!"},null,{"$f":"#REF!","v":{"$error":"#REF!"}},{"$f":"'9-10-MDM&EGG'!E18","v":0},{"$error":"#REF!"},null,{"$error":"#REF!"},{"$f":"'RICE ACCOUNT'!N19","v":120},null,0,{"$f":"'RICE ACCOUNT'!O19","v":110},null,{"$error":"#REF!"},0,{"$error":"#REF!"},null,{"$f":"'RICE ACCOUNT'!F19","v":0},{"$f":"'RICE ACCOUNT'!G19","v":0},0]
[15,{"$f":"#REF!","v":{"$error":"#REF!"}},{"$f":"'9-10-MDM&EGG'!C19","v":155},{"$error":"#REF!"},null,{"$f":"#REF!","v":{"$error":"#REF!"}},{"$f":"'9-10-MDM&EGG'!D19","v":0},{"$error":"#REF!"},null,{"$f":"#REF!","v":{"$error":"#REF!"}},{"$f":"'9-10-MDM&EGG'!E19","v":0},{"$error":"#REF!"},null,{"$error":"#REF!"},{"$f":"'RICE ACCOUNT'!N20","v":120},null,0,{"$f":"'RICE ACCOUNT'!O20","v":110},null,{"$error":"#REF!"},0,{"$error":"#REF!"},null,{"$f":"'RICE ACCOUNT'!F20","v":0},{"$f":"'RICE ACCOUNT'!G20","v":0},0]
[16,{"$f":"#REF!","v":{"$error":"#REF!"}},{"$f":"'9-10-MDM&EGG'!C20","v":166},{"$error":"#REF!"},null,{"$f":"#REF!","v":{"$error":"#REF!"}},{"$f":"'9-10-MDM&EGG'!D20","v":0},{"$error":"#REF!"},null,{"$f":"#REF!","v":{"$error":"#REF!"}},{"$f":"'9-10-MDM&EGG'!E20","v":0},{"$error":"#REF!"},null,{"$error":"#REF!"},{"$f":"'RICE ACCOUNT'!N21","v":120},null,0,{"$f":"'RICE ACCOUNT'!O21","v":110},null,{"$error":"#REF!"},0,{"$error":"#REF!"},null,{"$f":"'RICE ACCOUNT'!F21","v":0},{"$f":"'RICE ACCOUNT'!G21","v":0},0]
[17,{"$f":"#REF!","v":{"$error":"#REF!"}},{"$f":"'9-10-MDM&EGG'!C21","v":213},{"$error":"#REF!"},null,{"$f":"#REF!","v":{"$error":"#REF!"}},{"$f":"'9-10-MDM&EGG'!D21","v":0},{"$error":"#REF!"},null,{"$f":"#REF!","v":{"$error":"#REF!"}},{"$f":"'9-10-MDM&EGG'!E21","v":0},{"$error":"#REF!"},null,{"$error":"#REF!"},{"$f":"'RICE ACCOUNT'!N22","v":120},null,0,{"$f":"'RICE ACCOUNT'!O22","v":110},null,{"$error":"#REF!"},0,{"$error":"#REF!"},null,{"$f":"'RICE ACCOUNT'!F22","v":0},{"$f":"'RICE ACCOUNT'!G22","v":0},0]
[18,{"$f":"#REF!","v":{"$error":"#REF!"}},{"$f":"'9-10-MDM&EGG'!C22","v":213},{"$error":"#REF!"},null,{"$f":"#REF!","v":{"$error":"#REF!"}},{"$f":"'9-10-MDM&EGG'!D22","v":0},{"$error":"#REF!"},null,{"$f":"#REF!","v":{"$error":"#REF!"}},{"$f":"'9-10-MDM&EGG'!E22","v":0},{"$error":"#REF!"},null,{"$error":"#REF!"},{"$f":"'RICE ACCOUNT'!N23","v":120},null,0,{"$f":"'RICE ACCOUNT'!O23","v":110},null,{"$error":"#REF!"},0,{"$error":"#REF!"},null,{"$f":"'RICE ACCOUNT'!F23","v":0},{"$f":"'RICE ACCOUNT'!G23","v":0},0]
[19,{"$f":"#REF!","v":{"$error":"#REF!"}},{"$f":"'9-10-MDM&EGG'!C23","v":213},{"$error":"#REF!"},null,{"$f":"#REF!","v":{"$error":"#REF!"}},{"$f":"'9-10-MDM&EGG'!D23","v":0},{"$error":"#REF!"},null,{"$f":"#REF!","v":{"$error":"#REF!"}},{"$f":"'9-10-MDM&EGG'!E23","v":0},{"$error":"#REF!"},null,{"$error":"#REF!"},{"$f":"'RICE ACCOUNT'!N24","v":120},null,0,{"$f":"'RICE ACCOUNT'!O24","v":110},null,{"$error":"#REF!"},0,{"$error":"#REF!"},null,{"$f":"'RICE ACCOUNT'!F24","v":0},{"$f":"'RICE ACCOUNT'!G24","v":0},0]
[20,{"$f":"#REF!","v":{"$error":"#REF!"}},{"$f":"'9-10-MDM&EGG'!C24","v":213},{"$error":"#REF!"},null,{"$f":"#REF!","v":{"$error":"#REF!"}},{"$f":"'9-10-MDM&EGG'!D24","v":0},{"$error":"#REF!"},null,{"$f":"#REF!","v":{"$error":"#REF!"}},{"$f":"'9-10-MDM&EGG'!E24","v":0},{"$error":"#REF!"},null,{"$error":"#REF!"},{"$f":"'RICE ACCOUNT'!N25","v":120},null,0,{"$f":"'RICE ACCOUNT'!O25","v":110},null,{"$error":"#REF!"},0,{"$error":"#REF!"},null,{"$f":"'RICE ACCOUNT'!F25","v":0},{"$f":"'RICE ACCOUNT'!G25","v":0},0]
[21,{"$f":"#REF!","v":{"$error":"#REF!"}},{"$f":"'9-10-MDM&EGG'!C25","v":213},{"$error":"#REF!"},null,{"$f":"#REF!","v":{"$error":"#REF!"}},{"$f":"'9-10-MDM&EGG'!D25","v":0},{"$error":"#REF!"},null,{"$f":"#REF!","v":{"$error":"#REF!"}},{"$f":"'9-10-MDM&EGG'!E25","v":0},{"$error":"#REF!"},null,{"$error":"#REF!"},{"$f":"'RICE ACCOUNT'!N26","v":120},null,0,{"$f":"'RICE ACCOUNT'!O26","v":110},null,{"$error":"#REF!"},0,{"$error":"#REF!"},null,{"$f":"'RICE ACCOUNT'!F26","v":0},{"$f":"'RICE ACCOUNT'!G26","v":0},0]
[22,{"$f":"#REF!","v":{"$error":"#REF!"}},{"$f":"'9-10-MDM&EGG'!C26","v":213},{"$error":"#REF!"},null,{"$f":"#REF!","v":{"$error":"#REF!"}},{"$f":"'9-10-MDM&EGG'!D26","v":0},{"$error":"#REF!"},null,{"$f":"#REF!","v":{"$error":"#REF!"}},{"$f":"'9-10-MDM&EGG'!E26","v":0},{"$error":"#REF!"},null,{"$error":"#REF!"},{"$f":"'RICE ACCOUNT'!N27","v":120},null,0,{"$f":"'RICE ACCOUNT'!O27","v":110},null,{"$error":"#REF!"},0,{"$error":"#REF!"},null,{"$f":"'RICE ACCOUNT'!F27","v":0},{"$f":"'RICE ACCOUNT'!G27","v":0},0]
[23,{"$f":"#REF!","v":{"$error":"#REF!"}},{"$f":"'9-10-MDM&EGG'!C27","v":152},{"$error":"#REF!"},null,{"$f":"#REF!","v":{"$error":"#REF!"}},{"$f":"'9-10-MDM&EGG'!D27","v":0},{"$error":"#REF!"},null,{"$f":"#REF!","v":{"$error":"#REF!"}},{"$f":"'9-10-MDM&EGG'!E27","v":0},{"$error":"#REF!"},null,{"$error":"#REF!"},{"$f":"'RICE ACCOUNT'!N28","v":120},null,0,{"$f":"'RICE ACCOUNT'!O28","v":110},null,{"$error":"#REF!"},0,{"$error":"#REF!"},null,{"$f":"'RICE ACCOUNT'!F28","v":0},{"$f":"'RICE ACCOUNT'!G28","v":0},0]
[24,{"$f":"#REF!","v":{"$error":"#REF!"}},{"$f":"'9-10-MDM&EGG'!C28","v":213},{"$error":"#REF!"},null,{"$f":"#REF!","v":{"$error":"#REF!"}},{"$f":"'9-10-MDM&EGG'!D28","v":0},{"$error":"#REF!"},null,{"$f":"#REF!","v":{"$error":"#REF!"}},{"$f":"'9-10-MDM&EGG'!E28","v":0},{"$error":"#REF!"},null,{"$error":"#REF!"},{"$f":"'RICE ACCOUNT'!N29","v":120},null,0,{"$f":"'RICE ACCOUNT'!O29","v":110},null,{"$error":"#REF!"},0,{"$error":"#REF!"},null,{"$f":"'RICE ACCOUNT'!F29","v":0},{"$f":"'RICE ACCOUNT'!G29","v":0},0]
[25,{"$f":"#REF!","v":{"$error":"#REF!"}},{"$f":"'9-10-MDM&EGG'!C29","v":213},{"$error":"#REF!"},null,{"$f":"#REF!","v":{"$error":"#REF!"}},{"$f":"'9-10-MDM&EGG'!D29","v":0},{"$error":"#REF!"},null,{"$f":"#REF!","v":{"$error":"#REF!"}},{"$f":"'9-10-MDM&EGG'!E29","v":0},{"$error":"#REF!"},null,{"$error":"#REF!"},{"$f":"'RICE ACCOUNT'!N30","v":120},null,0,{"$f":"'RICE ACCOUNT'!O30","v":110},null,{"$error":"#REF!"},0,{"$error":"#REF!"},null,{"$f":"'RICE ACCOUNT'!F30","v":0},{"$f":"'RICE ACCOUNT'!G30","v":0},0]
[26,{"$f":"#REF!","v":{"$error":"#REF!"}},{"$f":"'9-10-MDM&EGG'!C30","v":213},{"$error":"#REF!"},null,{"$f":"#REF!","v":{"$error":"#REF!"}},{"$f":"'9-10-MDM&EGG'!D30","v":0},{"$error":"#REF!"},null,{"$f":"#REF!","v":{"$error":"#REF!"}},{"$f":"'9-10-MDM&EGG'!E30","v":0},{"$error":"#REF!"},null,{"$error":"#REF!"},{"$f":"'RICE ACCOUNT'!N31","v":120},null,0,{"$f":"'RICE ACCOUNT'!O31","v":110},null,{"$error":"#REF!"},0,{"$error":"#REF!"},null,{"$f":"'RICE ACCOUNT'!F31","v":0},{"$f":"'RICE ACCOUNT'!G31","v":0},0]
[27,{"$f":"#REF!","v":{"$error":"#REF!"}},{"$f":"'9-10-MDM&EGG'!C31","v":213},{"$error":"#REF!"},null,{"$f":"#REF!","v":{"$error":"#REF!"}},{"$f":"'9-10-MDM&EGG'!D31","v":0},{"$error":"#REF!"},null,{"$f":"#REF!","v":{"$error":"#REF!"}},{"$f":"'9-10-MDM&EGG'!E31","v":0},{"$error":"#REF!"},null,{"$error":"#REF!"},{"$f":"'RICE ACCOUNT'!N32","v":120},null,0,{"$f":"'RICE ACCOUNT'!O32","v":110},null,{"$error":"#REF!"},0,{"$error":"#REF!"},null,{"$f":"'RICE ACCOUNT'!F32","v":0},{"$f":"'RICE ACCOUNT'!G32","v":0},0]
[28,{"$f":"#REF!","v":{"$error":"#REF!"}},{"$f":"'9-10-MDM&EGG'!C32","v":213},{"$error":"#REF!"},null,{"$f":"#REF!","v":{"$error":"#REF!"}},{"$f":"'9-10-MDM&EGG'!D32","v":0},{"$error":"#REF!"},null,{"$f":"#REF!","v":{"$error":"#REF!"}},{"$f":"'9-10-MDM&EGG'!E32","v":0},{"$error":"#REF!"},null,{"$error":"#REF!"},{"$f":"'RICE ACCOUNT'!N33","v":120},null,0,{"$f":"'RICE ACCOUNT'!O33","v":110},null,{"$error":"#REF!"},0,{"$error":"#REF!"},null,{"$f":"'RICE ACCOUNT'!F33","v":0},{"$f":"'RICE ACCOUNT'!G33","v":0},0]
[29,{"$f":"#REF!","v":{"$error":"#REF!"}},{"$f":"'9-10-MDM&EGG'!C33","v":213},{"$error":"#REF!"},null,{"$f":"#REF!","v":{"$error":"#REF!"}},{"$f":"'9-10-MDM&EGG'!D33","v":0},{"$error":"#REF!"},null,{"$f":"#REF!","v":{"$error":"#REF!"}},{"$f":"'9-10-MDM&EGG'!E33","v":0},{"$error":"#REF!"},null,{"$error":"#REF!"},{"$f":"'RICE ACCOUNT'!N34","v":120},null,0,{"$f":"'RICE ACCOUNT'!O34","v":110},null,{"$error":"#REF!"},0,{"$error":"#REF!"},null,{"$f":"'RICE ACCOUNT'!F34","v":0},{"$f":"'RICE ACCOUNT'!G34","v":0},0]
[30,{"$f":"#REF!","v":{"$error":"#REF!"}},{"$f":"'9-10-MDM&EGG'!C34","v":213},{"$error":"#REF!"},null,{"$f":"#REF!","v":{"$error":"#REF!"}},{"$f":"'9-10-MDM&EGG'!D34","v":0},{"$error":"#REF!"},null,{"$f":"#REF!","v":{"$error":"#REF!"}},{"$f":"'9-10-MDM&EGG'!E34","v":0},{"$error":"#REF!"},null,{"$error":"#REF!"},{"$f":"'RICE ACCOUNT'!N35","v":120},null,0,{"$f":"'RICE ACCOUNT'!O35","v":110},null,{"$error":"#REF!"},0,{"$error":"#REF!"},null,{"$f":"'RICE ACCOUNT'!F35","v":0},{"$f":"'RICE ACCOUNT'!G35","v":0},0]
[31,{"$f":"#REF!","v":{"$error":"#REF!"}},{"$f":"'9-10-MDM&EGG'!C35","v":213},{"$error":"#REF!"},null,{"$f":"#REF!","v":{"$error":"#REF!"}},{"$f":"'9-10-MDM&EGG'!D35","v":0},{"$error":"#REF!"},null,{"$f":"#REF!","v":{"$error":"#REF!"}},{"$f":"'9-10-MDM&EGG'!E35","v":0},{"$error":"#REF!"},null,{"$error":"#REF!"},{"$f":"'RICE ACCOUNT'!N36","v":120},null,0,{"$f":"'RICE ACCOUNT'!O36","v":110},null,{"$error":"#REF!"},0,{"$error":"#REF!"},null,{"$f":"'RICE ACCOUNT'!F36","v":0},{"$f":"'RICE ACCOUNT'!G36","v":0},0]
[null,{"$f":"#REF!","v":{"$error":"#REF!"}},{"$f":"'9-10-MDM&EGG'!C36","v":0},{"$error":"#REF!"},null,{"$f":"SUM(F6:F36)","v":{"$error":"#REF!"}},{"$f":"SUM(G6:G36)","v":0},{"$error":"#REF!"},null,{"$f":"SUM(J6:J36)","v":{"$error":"#REF!"}},{"$f":"SUM(K6:K36)","v":0},{"$f":"SUM(L6:L36)","v":{"$error":"#REF!"}},null,{"$f":"SUM(N6:N36)","v":{"$error":"#REF!"}},{"$f":"O36","v":120},null,{"$f":"SUM(Q6:Q36)","v":0},{"$f":"R36","v":110},null,{"$error":"#REF!"},0,{"$error":"#REF!"},null,{"$f":"SUM(X6:X36)","v":0},{"$f":"SUM(Y6:Y36)","v":0},0]
[]
["RICE ACCOUNT"]
["OPENING BALANCE",null,null,null,null,"RECEIVED DURING THE MONTH",null,null,null,"TOTAL RICE",null,null,null,"UTILIZED DURING MONTH",null,null,null,null,null,null,"GROUND BALANCE",null,null,null,"REMARKS"]
[{"$f":"UPSBALANCE+HSBALANCE","v":230},null,null,null,null,{"$f":"$Z$37","v":0},null,null,null,{"$f":"SUM(A41:I41)","v":230},null,null,null,{"$f":"N37+Q37","v":{"$error":"#REF!"}},null,null,null,null,null,null,{"$f":"J41-N41","v":{"$error":"#REF!"}}]
[]
[]
[]
[null,null,null,null,null,null,null,null,null,null,null,null,null,null,null,null,null,null,null,null,null,null,null,null,null,null,"ఆలుగడ్డ టమాట"]
[null,null,null,null,null,null,null,null,null,null,null,null,null,null,null,null,null,null,null,null,null,null,null,null,null,null,"గుడ్డు+సాంబారు"]
[null,null,null,null,null,null,null,null,null,null,null,null,null,null,null,null,null,null,null,null,null,null,null,null,null,null,"అరటిపండు+సాంబారు"]
[null,null,null,null,null,null,null,null,null,null,null,null,null,null,null,null,null,null,null,null,null,null,null,null,null,null,"వంకాయ+ఆలుగడ్డ"]
[null,null,null,null,null,null,null,null,null,null,null,null,null,null,null,null,null,null,null,null,null,null,null,null,null,null,"సోరకాయ పప్పు"]
[null,null,null,null,null,null,null,null,null,null,null,null,null,null,null,null,null,null,null,null,null,null,null,null,null,null,"గుడ్డు+సాంబారు"]
[null,null,null,null,null,null,null,null,null,null,null,null,null,null,null,null,null,null,null,null,null,null,null,null,null,null,"బీరకాయ టమాట"]
[null,null,null,null,null,null,null,null,null,null,null,null,null,null,null,null,null,null,null,null,null,null,null,null,null,null,"వంకాయ+ఆలుగడ్డ"]
[null,null,null,null,null,null,null,null,null,null,null,null,null,null,null,null,null,null,null,null,"వంకాయ పప్పు",null,null,null,null,null,"గుడ్డు+సాంబారు"]
[null,null,null,null,null,null,null,null,null,null,null,null,null,null,null,null,null,null,null,null,null,null,null,null,null,null,"పప్పుచారు"]
[null,null,null,null,null,null,null,null,null,null,null,null,null,null,null,null,null,null,null,null,null,null,null,null,null,null,"సోరకాయ పప్పు"]
[null,null,null,null,null,null,null,null,null,null,null,null,null,null,null,null,null,null,null,null,null,null,null,null,null,null,"గుడ్డు+సాంబారు"]
[null,null,null,null,null,null,null,null,null,null,null,null,null,null,null,null,null,null,null,null,null,null,null,null,null,null,"వంకాయ+ఆలుగడ్డ"]
[null,null,null,null,null,null,null,null,null,null,null,null,null,null,null,null,null,null,null,null,null,null,null,null,null,null,"బీరకాయ పప్పు"]
[null,null,null,null,null,null,null,null,null,null,null,null,null,null,null,null,null,null,null,null,null,null,null,null,null,null,"గుడ్డు+సాంబారు"]

{"sheet":"PRIMARY INFORMATION","index":1,"n_rows":22,"n_cols":7,"rows_kept":22,"cut":false,"hidden":false,"merged":[[0,0,1,6]]}
["MDM BILLS PREPRATION TOOL WITH RICE ACCOUNT \nFOR HIGH SCHOOLS"]
[]
[]
[]
[null,"NAME OF THE SCHOOL","ZPHS ABC"]
[null,"MANDAL","XYZ",null,"UPS ENROLMENT",null,185]
[null,"NAME OF THE IA :","ABCDEF",null,"HS ENROLMENT",null,155]
[null,"IA ACCOUNT NO :",1324678911]
[null,"MONTH","2020-01-01",null,"NEXT MONTH RICE REUIREMENT"]
[null,"UPS RICE OPENING BALANCE",120,null,"UPS",null,600]
[null,"HS RICE OPENING BALANCE",110,null,"HIGH SCHOOL",null,600]
[null,"COST PER CHILD 6 TO 10",6.18]
[null,"COST PER CHILD 9 TO 10",8.18]
[null,"EGG COST",4]
[null,"PRESENT RICE BALANCE",{"$f":"$C$22","v":230}]
[]
[null,"UPS RICE",{"$f":"'RICE BALANC'!$A$8","v":120}]
[null,"HS RICE",{"$f":"'RICE BALANC'!$B$8","v":110}]
[]
[null,"CLOSING BALANCE OF UPS",{"$f":"'6-8-MDMonthly'!$J$35","v":120}]
[null,"CLOSING BALANCE OF HS",{"$f":"'9-10-MDM&EGG'!$J$35","v":110}]
[null,"PRESENT RICE BALANCE",{"$f":"SUM(C20:C21)","v":230}]

{"sheet":"ENTRY SHEET","index":2,"n_rows":56,"n_cols":15,"rows_kept":56,"cut":false,"hidden":false,"merged":[[2,11,3,11],[2,3,2,5],[2,6,2,8],[2,1,3,1],[2,2,3,2],[2,9,2,10]]}
[null,null,null,null,null,null,null,null,null,null,null,null,0]
[]
[null,"DATE","HOLIDAYS","UPS",null,null,"HS",null,null,"Rice RECEIVED",null,"MENU","TYPE EGG"]
[null,null,null,"ENROLLED","PRESENT","MDM TAKING","ENROLLED","PRESENT","MDM TAKING","UPS","HS",null,"ON GIVEN DAY"]
[null,1,null,{"$f":"UPSENR","v":185},null,null,{"$f":"HSENR","v":155}]
[null,2,null,{"$f":"D5","v":185},null,null,{"$f":"G5","v":155},null,null,null,null,null,null,{"$f":"F6+I6","v":0}]
[null,3,null,{"$f":"D6","v":185},null,null,{"$f":"G6","v":155},null,null,null,null,null,null,{"$f":"F7+I7","v":0}]
[null,4,null,185,null,null,155,null,null,null,null,null,null,0,"UPS 6.18"]
[null,5,"SUNDAY",185,null,null,155,null,null,null,null,null,null,0,"EGG 4"]
[null,6,null,185,null,null,155,null,null,null,null,null,null,0,"IX X 8.18"]
[null,7,null,185,null,null,155,null,null,null,null,null,null,0]
[null,8,null,185,null,null,155,null,null,null,null,null,null,0]
[null,9,null,185,null,null,155,null,null,null,null,null,null,0]
[null,10,null,185,null,null,155,null,null,null,null,null,null,0]
[null,11,null,185,null,null,155,null,null,null,null,null,null,0]
[null,12,"SUNDAY",185,null,null,155,null,null,null,null,null,null,0]
[null,13,null,185,null,null,155,null,null,null,null,null,null,0]
[null,14,null,185,null,null,155,null,null,null,null,null,null,0]
[null,15,null,185,null,null,155,null,null,null,null,null,null,0]
[null,16,null,185,null,null,155,null,null,null,null,null,null,0]
[null,17,null,185,null,null,213,null,null,null,null,null,null,0]
[null,18,null,185,null,null,213,null,null,null,null,null,null,0]
[null,19,"SUNDAY",185,null,null,213,null,null,null,null,null,null,0]
[null,20,null,185,null,null,213,null,null,null,null,null,null,0]
[null,21,null,185,null,null,213,null,null,null,null,null,null,0]
[null,22,null,185,null,null,213,null,null,null,null,null,null,0]
[null,23,null,185,null,null,213,null,null,null,null,null,null,0]
[null,24,null,185,null,null,213,null,null,null,null,null,null,0]
[null,25,null,185,null,null,213,null,null,null,null,null,null,0]
[null,26,"SUNDAY",185,null,null,213,null,null,null,null,null,null,0]
[null,27,null,185,null,null,213,null,null,null,null,null,null,0]
[null,28,null,185,null,null,213,null,null,null,null,null,null,0]
[null,29,null,185,null,null,213,null,null,null,null,null,null,0]
[null,30,null,185,null,null,213,null,null,null,null,null,null,0]
[null,31,null,185,null,null,213,null,null,null,null,null,null,0]
[null,null,null,{"$f":"SUM(D5:D35)","v":5735},{"$f":"SUM(E5:E35)","v":0},{"$f":"SUM(F5:F35)","v":0},5675,0,0,0,0,null,{"$f":"COUNTIF(M5:M35, \"EGG\")","v":0}]
[null,null,null,null,null,null,null,null,null,null,null,"TOMATO DAL"]
[null,null,null,null,null,null,null,null,null,null,null,"ALU CURRY"]
[null,null,null,null,null,null,null,null,null,null,null,"TOMATO DAL"]
[null,null,null,null,null,null,null,null,null,null,null,"ALU CURRY"]
[null,null,null,null,null,null,null,null,null,null,null,"DOSAKAYA CURRY"]
[null,null,null,null,null,null,null,null,null,null,null,"TOMATO DAL"]
[null,null,null,null,null,null,null,null,null,null,null,"BRINJAL CURRY"]
[null,null,null,null,null,null,null,null,null,null,null,"DOSAKAYA CURRY"]
[null,null,null,null,null,null,null,null,null,null,null,"TOMATO DAL"]
[null,null,null,null,null,null,null,null,null,null,null,"BENDAKAYA CURRY"]
[null,null,null,null,null,null,null,null,null,null,null,"TOMATO DAL"]
[null,null,null,null,null,null,null,null,null,null,null,"TOMATO DALL"]
[null,null,null,null,null,null,null,null,null,null,null,"BRINJAL CURRY"]
[null,null,null,null,null,null,null,null,null,null,null,"TOMATO DAL"]
[null,null,null,null,null,null,null,null,null,null,null,"TOMATO DAL"]
[null,null,null,null,null,null,null,null,null,null,null,"TOMATO DAL"]
[null,null,null,null,null,null,null,null,null,null,null,"ALU CURRY"]
[null,null,null,null,null,null,null,null,null,null,null,"TOMATO DAL"]
[null,null,null,null,null,null,null,null,null,null,null,"ALU CURRY"]
[null,null,null,null,null,null,null,null,null,null,null,"TOMATO DAL"]

{"sheet":"6-8-MDMonthly","index":3,"n_rows":43,"n_cols":19,"rows_kept":43,"cut":false,"hidden":false,"merged":[[37,0,37,8],[0,0,0,10],[1,0,1,1],[2,8,2,10]]}
[{"$f":"\"MID-DAY MEALS BILL FOR THE MONTH OF \" & TEXT(MONTH,\"MMMM-YYYY\")","v":"MID-DAY MEALS BILL FOR THE MONTH OF January-2020"}]
["MANDAL :",null,{"$f":"MANDAL","v":"XYZ"},null,{"$f":"SCHOOL","v":"ZPHS ABC"},null,null,null,null,null,"UPS(VI-VIII)",null,null,null,null,null,"PREVIOUS BALANCE","BALANCE",{"$f":"'PRIMARY INFORMATION'!$C$10+'PRIMARY INFORMATION'!$C$11","v":230}]
[{"$f":"\" NAME OF THE IA : \"& GROUP","v":" NAME OF THE IA : ABCDEF"},null,null,null,null,null,null,"A/c No",{"$f":"ACCNO","v":1324678911}]
["DAY","Holiday","TOTAL ENROLLMENT","TOTAL PRESENT","MDM TAKEN",{"$f":"\"Amount in Rs.@ \" & COSTPCHILDUPS","v":"Amount in Rs.@ 6.18"},"Opening Balance of Rice in Kg.Gms","Rice Received during the month in Kg.Gms","Rice Utilized in Kg.Gms @150gm","Closing Balance of Rice in Kg.Gms","Menu",null,null,"RISE USED","RICE BALANCE","RICE RECEIVED"]
[{"$f":"'ENTRY SHEET'!B5","v":1},{"$f":"IF('ENTRY SHEET'!C5=0,\"\",'ENTRY SHEET'!C5)","v":""},{"$f":"'ENTRY SHEET'!D5","v":185},{"$f":"'ENTRY SHEET'!E5","v":0},{"$f":"'ENTRY SHEET'!F5","v":0},{"$f":"E5*COSTPCHILDUPS","v":0},{"$f":"UPSBALANCE","v":120},{"$f":"'ENTRY SHEET'!J5","v":0},{"$f":"E5*0.15","v":0},{"$f":"G5+H5-I5","v":120},{"$f":"'ENTRY SHEET'!L5&IF('ENTRY SHEET'!M5=\"EGG\",\"+\"&'ENTRY SHEET'!M5,\"\")","v":""},null,null,{"$f":"F5*150/1000","v":0},{"$f":"($P$2)-N5","v":0}]
[{"$f":"'ENTRY SHEET'!B6","v":2},{"$f":"IF('ENTRY SHEET'!C6=0,\"\",'ENTRY SHEET'!C6)","v":""},{"$f":"'ENTRY SHEET'!D6","v":185},{"$f":"'ENTRY SHEET'!E6","v":0},{"$f":"'ENTRY SHEET'!F6","v":0},0,{"$f":"J5","v":120},{"$f":"'ENTRY SHEET'!J6","v":0},{"$f":"E6*0.15","v":0},{"$f":"G6+H6-I6","v":120},{"$f":"'ENTRY SHEET'!L6&IF('ENTRY SHEET'!M6=\"EGG\",\"+\"&'ENTRY SHEET'!M6,\"\")","v":""},null,null,0,{"$f":"(O5+P5)-N6","v":0}]
[{"$f":"'ENTRY SHEET'!B7","v":3},{"$f":"IF('ENTRY SHEET'!C7=0,\"\",'ENTRY SHEET'!C7)","v":""},{"$f":"'ENTRY SHEET'!D7","v":185},{"$f":"'ENTRY SHEET'!E7","v":0},{"$f":"'ENTRY SHEET'!F7","v":0},0,{"$f":"J6","v":120},{"$f":"'ENTRY SHEET'!J7","v":0},0,120,{"$f":"'ENTRY SHEET'!L7&IF('ENTRY SHEET'!M7=\"EGG\",\"+\"&'ENTRY SHEET'!M7,\"\")","v":""},null,null,0,{"$f":"(O6+P6)-N7","v":0}]
[{"$f":"'ENTRY SHEET'!B8","v":4},{"$f":"IF('ENTRY SHEET'!C8=0,\"\",'ENTRY SHEET'!C8)","v":""},{"$f":"'ENTRY SHEET'!D8","v":185},{"$f":"'ENTRY SHEET'!E8","v":0},{"$f":"'ENTRY SHEET'!F8","v":0},0,120,{"$f":"'ENTRY SHEET'!J8","v":0},0,120,{"$f":"'ENTRY SHEET'!L8&IF('ENTRY SHEET'!M8=\"EGG\",\"+\"&'ENTRY SHEET'!M8,\"\")","v":""},null,null,0,0]
[{"$f":"'ENTRY SHEET'!B9","v":5},{"$f":"IF('ENTRY SHEET'!C9=0,\"\",'ENTRY SHEET'!C9)","v":"SUNDAY"},{"$f":"'ENTRY SHEET'!D9","v":185},{"$f":"'ENTRY SHEET'!E9","v":0},{"$f":"'ENTRY SHEET'!F9","v":0},0,120,{"$f":"'ENTRY SHEET'!J9","v":0},0,120,{"$f":"'ENTRY SHEET'!L9&IF('ENTRY SHEET'!M9=\"EGG\",\"+\"&'ENTRY SHEET'!M9,\"\")","v":""},null,null,0,0]
[{"$f":"'ENTRY SHEET'!B10","v":6},{"$f":"IF('ENTRY SHEET'!C10=0,\"\",'ENTRY SHEET'!C10)","v":""},{"$f":"'ENTRY SHEET'!D10","v":185},{"$f":"'ENTRY SHEET'!E10","v":0},{"$f":"'ENTRY SHEET'!F10","v":0},0,120,{"$f":"'ENTRY SHEET'!J10","v":0},0,120,{"$f":"'ENTRY SHEET'!L10&IF('ENTRY SHEET'!M10=\"EGG\",\"+\"&'ENTRY SHEET'!M10,\"\")","v":""},null,null,0,0]
[{"$f":"'ENTRY SHEET'!B11","v":7},{"$f":"IF('ENTRY SHEET'!C11=0,\"\",'ENTRY SHEET'!C11)","v":""},{"$f":"'ENTRY SHEET'!D11","v":185},{"$f":"'ENTRY SHEET'!E11","v":0},{"$f":"'ENTRY SHEET'!F11","v":0},0,120,{"$f":"'ENTRY SHEET'!J11","v":0},0,120,{"$f":"'ENTRY SHEET'!L11&IF('ENTRY SHEET'!M11=\"EGG\",\"+\"&'ENTRY SHEET'!M11,\"\")","v":""},null,null,0,0]
[{"$f":"'ENTRY SHEET'!B12","v":8},{"$f":"IF('ENTRY SHEET'!C12=0,\"\",'ENTRY SHEET'!C12)","v":""},{"$f":"'ENTRY SHEET'!D12","v":185},{"$f":"'ENTRY SHEET'!E12","v":0},{"$f":"'ENTRY SHEET'!F12","v":0},0,120,{"$f":"'ENTRY SHEET'!J12","v":0},0,120,{"$f":"'ENTRY SHEET'!L12&IF('ENTRY SHEET'!M12=\"EGG\",\"+\"&'ENTRY SHEET'!M12,\"\")","v":""},null,null,0,0]
[{"$f":"'ENTRY SHEET'!B13","v":9},{"$f":"IF('ENTRY SHEET'!C13=0,\"\",'ENTRY SHEET'!C13)","v":""},{"$f":"'ENTRY SHEET'!D13","v":185},{"$f":"'ENTRY SHEET'!E13","v":0},{"$f":"'ENTRY SHEET'!F13","v":0},0,120,{"$f":"'ENTRY SHEET'!J13","v":0},0,120,{"$f":"'ENTRY SHEET'!L13&IF('ENTRY SHEET'!M13=\"EGG\",\"+\"&'ENTRY SHEET'!M13,\"\")","v":""},null,null,0,0]
[{"$f":"'ENTRY SHEET'!B14","v":10},{"$f":"IF('ENTRY SHEET'!C14=0,\"\",'ENTRY SHEET'!C14)","v":""},{"$f":"'ENTRY SHEET'!D14","v":185},{"$f":"'ENTRY SHEET'!E14","v":0},{"$f":"'ENTRY SHEET'!F14","v":0},0,120,{"$f":"'ENTRY SHEET'!J14","v":0},0,120,{"$f":"'ENTRY SHEET'!L14&IF('ENTRY SHEET'!M14=\"EGG\",\"+\"&'ENTRY SHEET'!M14,\"\")","v":""},null,null,0,0]
[{"$f":"'ENTRY SHEET'!B15","v":11},{"$f":"IF('ENTRY SHEET'!C15=0,\"\",'ENTRY SHEET'!C15)","v":""},{"$f":"'ENTRY SHEET'!D15","v":185},{"$f":"'ENTRY SHEET'!E15","v":0},{"$f":"'ENTRY SHEET'!F15","v":0},0,120,{"$f":"'ENTRY SHEET'!J15","v":0},0,120,{"$f":"'ENTRY SHEET'!L15&IF('ENTRY SHEET'!M15=\"EGG\",\"+\"&'ENTRY SHEET'!M15,\"\")","v":""},null,null,0,0]
[{"$f":"'ENTRY SHEET'!B16","v":12},{"$f":"IF('ENTRY SHEET'!C16=0,\"\",'ENTRY SHEET'!C16)","v":"SUNDAY"},{"$f":"'ENTRY SHEET'!D16","v":185},{"$f":"'ENTRY SHEET'!E16","v":0},{"$f":"'ENTRY SHEET'!F16","v":0},0,120,{"$f":"'ENTRY SHEET'!J16","v":0},0,120,{"$f":"'ENTRY SHEET'!L16&IF('ENTRY SHEET'!M16=\"EGG\",\"+\"&'ENTRY SHEET'!M16,\"\")","v":""},null,null,0,0]
[{"$f":"'ENTRY SHEET'!B17","v":13},{"$f":"IF('ENTRY SHEET'!C17=0,\"\",'ENTRY SHEET'!C17)","v":""},{"$f":"'ENTRY SHEET'!D17","v":185},{"$f":"'ENTRY SHEET'!E17","v":0},{"$f":"'ENTRY SHEET'!F17","v":0},0,120,{"$f":"'ENTRY SHEET'!J17","v":0},0,120,{"$f":"'ENTRY SHEET'!L17&IF('ENTRY SHEET'!M17=\"EGG\",\"+\"&'ENTRY SHEET'!M17,\"\")","v":""},null,null,0,0]
[{"$f":"'ENTRY SHEET'!B18","v":14},{"$f":"IF('ENTRY SHEET'!C18=0,\"\",'ENTRY SHEET'!C18)","v":""},{"$f":"'ENTRY SHEET'!D18","v":185},{"$f":"'ENTRY SHEET'!E18","v":0},{"$f":"'ENTRY SHEET'!F18","v":0},0,120,{"$f":"'ENTRY SHEET'!J18","v":0},0,120,{"$f":"'ENTRY SHEET'!L18&IF('ENTRY SHEET'!M18=\"EGG\",\"+\"&'ENTRY SHEET'!M18,\"\")","v":""},null,null,0,0]
[{"$f":"'ENTRY SHEET'!B19","v":15},{"$f":"IF('ENTRY SHEET'!C19=0,\"\",'ENTRY SHEET'!C19)","v":""},{"$f":"'ENTRY SHEET'!D19","v":185},{"$f":"'ENTRY SHEET'!E19","v":0},{"$f":"'ENTRY SHEET'!F19","v":0},0,120,{"$f":"'ENTRY SHEET'!J19","v":0},0,120,{"$f":"'ENTRY SHEET'!L19&IF('ENTRY SHEET'!M19=\"EGG\",\"+\"&'ENTRY SHEET'!M19,\"\")","v":""},null,null,0,0]
[{"$f":"'ENTRY SHEET'!B20","v":16},{"$f":"IF('ENTRY SHEET'!C20=0,\"\",'ENTRY SHEET'!C20)","v":""},{"$f":"'ENTRY SHEET'!D20","v":185},{"$f":"'ENTRY SHEET'!E20","v":0},{"$f":"'ENTRY SHEET'!F20","v":0},0,120,{"$f":"'ENTRY SHEET'!J20","v":0},0,120,{"$f":"'ENTRY SHEET'!L20&IF('ENTRY SHEET'!M20=\"EGG\",\"+\"&'ENTRY SHEET'!M20,\"\")","v":""},null,null,0,0]
[{"$f":"'ENTRY SHEET'!B21","v":17},{"$f":"IF('ENTRY SHEET'!C21=0,\"\",'ENTRY SHEET'!C21)","v":""},{"$f":"'ENTRY SHEET'!D21","v":185},{"$f":"'ENTRY SHEET'!E21","v":0},{"$f":"'ENTRY SHEET'!F21","v":0},0,120,{"$f":"'ENTRY SHEET'!J21","v":0},0,120,{"$f":"'ENTRY SHEET'!L21&IF('ENTRY SHEET'!M21=\"EGG\",\"+\"&'ENTRY SHEET'!M21,\"\")","v":""},null,null,0,0]
[{"$f":"'ENTRY SHEET'!B22","v":18},{"$f":"IF('ENTRY SHEET'!C22=0,\"\",'ENTRY SHEET'!C22)","v":""},{"$f":"'ENTRY SHEET'!D22","v":185},{"$f":"'ENTRY SHEET'!E22","v":0},{"$f":"'ENTRY SHEET'!F22","v":0},0,120,{"$f":"'ENTRY SHEET'!J22","v":0},0,120,{"$f":"'ENTRY SHEET'!L22&IF('ENTRY SHEET'!M22=\"EGG\",\"+\"&'ENTRY SHEET'!M22,\"\")","v":""},null,null,0,0]
[{"$f":"'ENTRY SHEET'!B23","v":19},{"$f":"IF('ENTRY SHEET'!C23=0,\"\",'ENTRY SHEET'!C23)","v":"SUNDAY"},{"$f":"'ENTRY SHEET'!D23","v":185},{"$f":"'ENTRY SHEET'!E23","v":0},{"$f":"'ENTRY SHEET'!F23","v":0},0,120,{"$f":"'ENTRY SHEET'!J23","v":0},0,120,{"$f":"'ENTRY SHEET'!L23&IF('ENTRY SHEET'!M23=\"EGG\",\"+\"&'ENTRY SHEET'!M23,\"\")","v":""},null,null,0,0]
[{"$f":"'ENTRY SHEET'!B24","v":20},{"$f":"IF('ENTRY SHEET'!C24=0,\"\",'ENTRY SHEET'!C24)","v":""},{"$f":"'ENTRY SHEET'!D24","v":185},{"$f":"'ENTRY SHEET'!E24","v":0},{"$f":"'ENTRY SHEET'!F24","v":0},0,120,{"$f":"'ENTRY SHEET'!J24","v":0},0,120,{"$f":"'ENTRY SHEET'!L24&IF('ENTRY SHEET'!M24=\"EGG\",\"+\"&'ENTRY SHEET'!M24,\"\")","v":""},null,null,0,0]
[{"$f":"'ENTRY SHEET'!B25","v":21},{"$f":"IF('ENTRY SHEET'!C25=0,\"\",'ENTRY SHEET'!C25)","v":""},{"$f":"'ENTRY SHEET'!D25","v":185},{"$f":"'ENTRY SHEET'!E25","v":0},{"$f":"'ENTRY SHEET'!F25","v":0},0,120,{"$f":"'ENTRY SHEET'!J25","v":0},0,120,{"$f":"'ENTRY SHEET'!L25&IF('ENTRY SHEET'!M25=\"EGG\",\"+\"&'ENTRY SHEET'!M25,\"\")","v":""},null,null,0,0]
[{"$f":"'ENTRY SHEET'!B26","v":22},{"$f":"IF('ENTRY SHEET'!C26=0,\"\",'ENTRY SHEET'!C26)","v":""},{"$f":"'ENTRY SHEET'!D26","v":185},{"$f":"'ENTRY SHEET'!E26","v":0},{"$f":"'ENTRY SHEET'!F26","v":0},0,120,{"$f":"'ENTRY SHEET'!J26","v":0},0,120,{"$f":"'ENTRY SHEET'!L26&IF('ENTRY SHEET'!M26=\"EGG\",\"+\"&'ENTRY SHEET'!M26,\"\")","v":""},null,null,0,0]
[{"$f":"'ENTRY SHEET'!B27","v":23},{"$f":"IF('ENTRY SHEET'!C27=0,\"\",'ENTRY SHEET'!C27)","v":""},{"$f":"'ENTRY SHEET'!D27","v":185},{"$f":"'ENTRY SHEET'!E27","v":0},{"$f":"'ENTRY SHEET'!F27","v":0},0,120,{"$f":"'ENTRY SHEET'!J27","v":0},0,120,{"$f":"'ENTRY SHEET'!L27&IF('ENTRY SHEET'!M27=\"EGG\",\"+\"&'ENTRY SHEET'!M27,\"\")","v":""},null,null,0,0]
[{"$f":"'ENTRY SHEET'!B28","v":24},{"$f":"IF('ENTRY SHEET'!C28=0,\"\",'ENTRY SHEET'!C28)","v":""},{"$f":"'ENTRY SHEET'!D28","v":185},{"$f":"'ENTRY SHEET'!E28","v":0},{"$f":"'ENTRY SHEET'!F28","v":0},0,120,{"$f":"'ENTRY SHEET'!J28","v":0},0,120,{"$f":"'ENTRY SHEET'!L28&IF('ENTRY SHEET'!M28=\"EGG\",\"+\"&'ENTRY SHEET'!M28,\"\")","v":""},null,null,0,0]
[{"$f":"'ENTRY SHEET'!B29","v":25},{"$f":"IF('ENTRY SHEET'!C29=0,\"\",'ENTRY SHEET'!C29)","v":""},{"$f":"'ENTRY SHEET'!D29","v":185},{"$f":"'ENTRY SHEET'!E29","v":0},{"$f":"'ENTRY SHEET'!F29","v":0},0,120,{"$f":"'ENTRY SHEET'!J29","v":0},0,120,{"$f":"'ENTRY SHEET'!L29&IF('ENTRY SHEET'!M29=\"EGG\",\"+\"&'ENTRY SHEET'!M29,\"\")","v":""},null,null,0,0]
[{"$f":"'ENTRY SHEET'!B30","v":26},{"$f":"IF('ENTRY SHEET'!C30=0,\"\",'ENTRY SHEET'!C30)","v":"SUNDAY"},{"$f":"'ENTRY SHEET'!D30","v":185},{"$f":"'ENTRY SHEET'!E30","v":0},{"$f":"'ENTRY SHEET'!F30","v":0},0,120,{"$f":"'ENTRY SHEET'!J30","v":0},0,120,{"$f":"'ENTRY SHEET'!L30&IF('ENTRY SHEET'!M30=\"EGG\",\"+\"&'ENTRY SHEET'!M30,\"\")","v":""},null,null,0,0]
[{"$f":"'ENTRY SHEET'!B31","v":27},{"$f":"IF('ENTRY SHEET'!C31=0,\"\",'ENTRY SHEET'!C31)","v":""},{"$f":"'ENTRY SHEET'!D31","v":185},{"$f":"'ENTRY SHEET'!E31","v":0},{"$f":"'ENTRY SHEET'!F31","v":0},0,120,{"$f":"'ENTRY SHEET'!J31","v":0},0,120,{"$f":"'ENTRY SHEET'!L31&IF('ENTRY SHEET'!M31=\"EGG\",\"+\"&'ENTRY SHEET'!M31,\"\")","v":""},null,null,0,0]
[{"$f":"'ENTRY SHEET'!B32","v":28},{"$f":"IF('ENTRY SHEET'!C32=0,\"\",'ENTRY SHEET'!C32)","v":""},{"$f":"'ENTRY SHEET'!D32","v":185},{"$f":"'ENTRY SHEET'!E32","v":0},{"$f":"'ENTRY SHEET'!F32","v":0},0,120,{"$f":"'ENTRY SHEET'!J32","v":0},0,120,{"$f":"'ENTRY SHEET'!L32&IF('ENTRY SHEET'!M32=\"EGG\",\"+\"&'ENTRY SHEET'!M32,\"\")","v":""},null,null,0,0]
[{"$f":"'ENTRY SHEET'!B33","v":29},{"$f":"IF('ENTRY SHEET'!C33=0,\"\",'ENTRY SHEET'!C33)","v":""},{"$f":"'ENTRY SHEET'!D33","v":185},{"$f":"'ENTRY SHEET'!E33","v":0},{"$f":"'ENTRY SHEET'!F33","v":0},0,120,{"$f":"'ENTRY SHEET'!J33","v":0},0,120,{"$f":"'ENTRY SHEET'!L33&IF('ENTRY SHEET'!M33=\"EGG\",\"+\"&'ENTRY SHEET'!M33,\"\")","v":""},null,null,0,0]
[{"$f":"'ENTRY SHEET'!B34","v":30},{"$f":"IF('ENTRY SHEET'!C34=0,\"\",'ENTRY SHEET'!C34)","v":""},{"$f":"'ENTRY SHEET'!D34","v":185},{"$f":"'ENTRY SHEET'!E34","v":0},{"$f":"'ENTRY SHEET'!F34","v":0},0,120,{"$f":"'ENTRY SHEET'!J34","v":0},0,{"$f":"G34+H34-I34","v":120},{"$f":"'ENTRY SHEET'!L34&IF('ENTRY SHEET'!M34=\"EGG\",\"+\"&'ENTRY SHEET'!M34,\"\")","v":""},null,null,0,0]
[{"$f":"'ENTRY SHEET'!B35","v":31},{"$f":"IF('ENTRY SHEET'!C35=0,\"\",'ENTRY SHEET'!C35)","v":""},{"$f":"'ENTRY SHEET'!D35","v":185},{"$f":"'ENTRY SHEET'!E35","v":0},{"$f":"'ENTRY SHEET'!F35","v":0},0,120,{"$f":"'ENTRY SHEET'!J35","v":0},0,{"$f":"G35+H35-I35","v":120},{"$f":"'ENTRY SHEET'!L35&IF('ENTRY SHEET'!M35=\"EGG\",\"+\"&'ENTRY SHEET'!M35,\"\")","v":""},null,null,0,0]
[null,null,null,{"$f":"SUM(D5:D35)","v":0},{"$f":"SUM(E5:E35)","v":0},{"$f":"SUM(F5:F35)","v":0},{"$f":"G35","v":120},{"$f":"H35","v":0},{"$f":"SUM(I5:I35)","v":0},null,null,null,null,0,0]
[]
["Certified that Two(2) Eggs per week suplied to students, Rice Required for NextMonth :",null,null,null,null,null,null,null,null,{"$f":"UPSRICE & \" KG\"","v":"600 KG"}]
["Sign. Of the Implementing Agency  1)…………………………………………..2)…………………………………………"]
[null,null,null,null,null,null,null,null,"Sign. Of the Head Master"]
[{"$f":"\"Pass Order : Sum of Rs.: \" &TEXT(F36,\"##,##,##.00\")","v":"Pass Order : Sum of Rs.: .00"}]
[{"$f":"\"(Rupees \"&rswords(F36)&\")\"","v":"(Rupees Rupees Nil)"}]
["may be sanctioned & Credited into MDM implementing Agency Account",null,null,null,null,null,null,null,"Mandal Educational Officer"]

{"sheet":"6-8-EGG BILL","index":4,"n_rows":45,"n_cols":10,"rows_kept":45,"cut":false,"hidden":false,"merged":[[0,0,0,7],[2,2,2,4],[2,5,2,6],[38,0,38,6],[39,0,39,1],[39,5,39,6]]}
[{"$f":"\"MID-DAY MEALS BILL FOR THE MONTH OF \" & TEXT(MONTH,\"MMMM-YYYY\")","v":"MID-DAY MEALS BILL FOR THE MONTH OF January-2020"}]
[{"$f":"\"MANDAL : \"&MANDAL & \"        SCHOOL:  \"","v":"MANDAL : XYZ        SCHOOL:  "},null,{"$f":"SCHOOL","v":"ZPHS ABC"},null,null,null,null,"UPS-EGG BILL","PREVIOUS BALANCE",{"$f":"'PRIMARY INFORMATION'!$C$10+'PRIMARY INFORMATION'!$C$11","v":230}]
[{"$f":"\" NAME OF THE IA : \"& GROUP","v":" NAME OF THE IA : ABCDEF"},null,"A/c No.:",null,null,{"$f":"ACCNO","v":1324678911}]
["DAY","Holiday","TOTAL ENROLLMENT","TOTAL PRESENT","MDM TAKEN",{"$f":"\"Amount in Rs.@ \" & EGGCOST","v":"Amount in Rs.@ 4"},null,"Menu"]
[{"$f":"'ENTRY SHEET'!B5","v":1},{"$f":"IF('ENTRY SHEET'!C5=0,\"\",'ENTRY SHEET'!C5)","v":""},{"$f":"IF((H5=\"EGG\"),'ENTRY SHEET'!D5,0)","v":0},{"$f":"IF((H5=\"EGG\"),'ENTRY SHEET'!E5,0)","v":0},{"$f":"IF((H5=\"EGG\"),'ENTRY SHEET'!F5,0)","v":0},{"$f":"E5*EGGCOST","v":0},null,{"$f":"'ENTRY SHEET'!M5","v":0}]
[{"$f":"'ENTRY SHEET'!B6","v":2},{"$f":"IF('ENTRY SHEET'!C6=0,\"\",'ENTRY SHEET'!C6)","v":""},{"$f":"IF((H6=\"EGG\"),'ENTRY SHEET'!D6,0)","v":0},{"$f":"IF((H6=\"EGG\"),'ENTRY SHEET'!E6,0)","v":0},{"$f":"IF((H6=\"EGG\"),'ENTRY SHEET'!F6,0)","v":0},0,null,{"$f":"'ENTRY SHEET'!M6","v":0}]
[{"$f":"'ENTRY SHEET'!B7","v":3},{"$f":"IF('ENTRY SHEET'!C7=0,\"\",'ENTRY SHEET'!C7)","v":""},{"$f":"IF((H7=\"EGG\"),'ENTRY SHEET'!D7,0)","v":0},{"$f":"IF((H7=\"EGG\"),'ENTRY SHEET'!E7,0)","v":0},{"$f":"IF((H7=\"EGG\"),'ENTRY SHEET'!F7,0)","v":0},0,null,{"$f":"'ENTRY SHEET'!M7","v":0}]
[{"$f":"'ENTRY SHEET'!B8","v":4},{"$f":"IF('ENTRY SHEET'!C8=0,\"\",'ENTRY SHEET'!C8)","v":""},{"$f":"IF((H8=\"EGG\"),'ENTRY SHEET'!D8,0)","v":0},{"$f":"IF((H8=\"EGG\"),'ENTRY SHEET'!E8,0)","v":0},{"$f":"IF((H8=\"EGG\"),'ENTRY SHEET'!F8,0)","v":0},0,null,{"$f":"'ENTRY SHEET'!M8","v":0}]
[{"$f":"'ENTRY SHEET'!B9","v":5},{"$f":"IF('ENTRY SHEET'!C9=0,\"\",'ENTRY SHEET'!C9)","v":"SUNDAY"},{"$f":"IF((H9=\"EGG\"),'ENTRY SHEET'!D9,0)","v":0},{"$f":"IF((H9=\"EGG\"),'ENTRY SHEET'!E9,0)","v":0},{"$f":"IF((H9=\"EGG\"),'ENTRY SHEET'!F9,0)","v":0},0,null,{"$f":"'ENTRY SHEET'!M9","v":0}]
[{"$f":"'ENTRY SHEET'!B10","v":6},{"$f":"IF('ENTRY SHEET'!C10=0,\"\",'ENTRY SHEET'!C10)","v":""},{"$f":"IF((H10=\"EGG\"),'ENTRY SHEET'!D10,0)","v":0},{"$f":"IF((H10=\"EGG\"),'ENTRY SHEET'!E10,0)","v":0},{"$f":"IF((H10=\"EGG\"),'ENTRY SHEET'!F10,0)","v":0},0,null,{"$f":"'ENTRY SHEET'!M10","v":0}]
[{"$f":"'ENTRY SHEET'!B11","v":7},{"$f":"IF('ENTRY SHEET'!C11=0,\"\",'ENTRY SHEET'!C11)","v":""},{"$f":"IF((H11=\"EGG\"),'ENTRY SHEET'!D11,0)","v":0},{"$f":"IF((H11=\"EGG\"),'ENTRY SHEET'!E11,0)","v":0},{"$f":"IF((H11=\"EGG\"),'ENTRY SHEET'!F11,0)","v":0},0,null,{"$f":"'ENTRY SHEET'!M11","v":0}]
[{"$f":"'ENTRY SHEET'!B12","v":8},{"$f":"IF('ENTRY SHEET'!C12=0,\"\",'ENTRY SHEET'!C12)","v":""},{"$f":"IF((H12=\"EGG\"),'ENTRY SHEET'!D12,0)","v":0},{"$f":"IF((H12=\"EGG\"),'ENTRY SHEET'!E12,0)","v":0},{"$f":"IF((H12=\"EGG\"),'ENTRY SHEET'!F12,0)","v":0},0,null,{"$f":"'ENTRY SHEET'!M12","v":0}]
[{"$f":"'ENTRY SHEET'!B13","v":9},{"$f":"IF('ENTRY SHEET'!C13=0,\"\",'ENTRY SHEET'!C13)","v":""},{"$f":"IF((H13=\"EGG\"),'ENTRY SHEET'!D13,0)","v":0},{"$f":"IF((H13=\"EGG\"),'ENTRY SHEET'!E13,0)","v":0},{"$f":"IF((H13=\"EGG\"),'ENTRY SHEET'!F13,0)","v":0},0,null,{"$f":"'ENTRY SHEET'!M13","v":0}]
[{"$f":"'ENTRY SHEET'!B14","v":10},{"$f":"IF('ENTRY SHEET'!C14=0,\"\",'ENTRY SHEET'!C14)","v":""},{"$f":"IF((H14=\"EGG\"),'ENTRY SHEET'!D14,0)","v":0},{"$f":"IF((H14=\"EGG\"),'ENTRY SHEET'!E14,0)","v":0},{"$f":"IF((H14=\"EGG\"),'ENTRY SHEET'!F14,0)","v":0},0,null,{"$f":"'ENTRY SHEET'!M14","v":0}]
[{"$f":"'ENTRY SHEET'!B15","v":11},{"$f":"IF('ENTRY SHEET'!C15=0,\"\",'ENTRY SHEET'!C15)","v":""},{"$f":"IF((H15=\"EGG\"),'ENTRY SHEET'!D15,0)","v":0},{"$f":"IF((H15=\"EGG\"),'ENTRY SHEET'!E15,0)","v":0},{"$f":"IF((H15=\"EGG\"),'ENTRY SHEET'!F15,0)","v":0},0,null,{"$f":"'ENTRY SHEET'!M15","v":0}]
[{"$f":"'ENTRY SHEET'!B16","v":12},{"$f":"IF('ENTRY SHEET'!C16=0,\"\",'ENTRY SHEET'!C16)","v":"SUNDAY"},{"$f":"IF((H16=\"EGG\"),'ENTRY SHEET'!D16,0)","v":0},{"$f":"IF((H16=\"EGG\"),'ENTRY SHEET'!E16,0)","v":0},{"$f":"IF((H16=\"EGG\"),'ENTRY SHEET'!F16,0)","v":0},0,null,{"$f":"'ENTRY SHEET'!M16","v":0}]
[{"$f":"'ENTRY SHEET'!B17","v":13},{"$f":"IF('ENTRY SHEET'!C17=0,\"\",'ENTRY SHEET'!C17)","v":""},{"$f":"IF((H17=\"EGG\"),'ENTRY SHEET'!D17,0)","v":0},{"$f":"IF((H17=\"EGG\"),'ENTRY SHEET'!E17,0)","v":0},{"$f":"IF((H17=\"EGG\"),'ENTRY SHEET'!F17,0)","v":0},0,null,{"$f":"'ENTRY SHEET'!M17","v":0}]
[{"$f":"'ENTRY SHEET'!B18","v":14},{"$f":"IF('ENTRY SHEET'!C18=0,\"\",'ENTRY SHEET'!C18)","v":""},{"$f":"IF((H18=\"EGG\"),'ENTRY SHEET'!D18,0)","v":0},{"$f":"IF((H18=\"EGG\"),'ENTRY SHEET'!E18,0)","v":0},{"$f":"IF((H18=\"EGG\"),'ENTRY SHEET'!F18,0)","v":0},0,null,{"$f":"'ENTRY SHEET'!M18","v":0}]
[{"$f":"'ENTRY SHEET'!B19","v":15},{"$f":"IF('ENTRY SHEET'!C19=0,\"\",'ENTRY SHEET'!C19)","v":""},{"$f":"IF((H19=\"EGG\"),'ENTRY SHEET'!D19,0)","v":0},{"$f":"IF((H19=\"EGG\"),'ENTRY SHEET'!E19,0)","v":0},{"$f":"IF((H19=\"EGG\"),'ENTRY SHEET'!F19,0)","v":0},0,null,{"$f":"'ENTRY SHEET'!M19","v":0}]
[{"$f":"'ENTRY SHEET'!B20","v":16},{"$f":"IF('ENTRY SHEET'!C20=0,\"\",'ENTRY SHEET'!C20)","v":""},{"$f":"IF((H20=\"EGG\"),'ENTRY SHEET'!D20,0)","v":0},{"$f":"IF((H20=\"EGG\"),'ENTRY SHEET'!E20,0)","v":0},{"$f":"IF((H20=\"EGG\"),'ENTRY SHEET'!F20,0)","v":0},0,null,{"$f":"'ENTRY SHEET'!M20","v":0}]
[{"$f":"'ENTRY SHEET'!B21","v":17},{"$f":"IF('ENTRY SHEET'!C21=0,\"\",'ENTRY SHEET'!C21)","v":""},{"$f":"IF((H21=\"EGG\"),'ENTRY SHEET'!D21,0)","v":0},{"$f":"IF((H21=\"EGG\"),'ENTRY SHEET'!E21,0)","v":0},{"$f":"IF((H21=\"EGG\"),'ENTRY SHEET'!F21,0)","v":0},0,null,{"$f":"'ENTRY SHEET'!M21","v":0}]
[{"$f":"'ENTRY SHEET'!B22","v":18},{"$f":"IF('ENTRY SHEET'!C22=0,\"\",'ENTRY SHEET'!C22)","v":""},{"$f":"IF((H22=\"EGG\"),'ENTRY SHEET'!D22,0)","v":0},{"$f":"IF((H22=\"EGG\"),'ENTRY SHEET'!E22,0)","v":0},{"$f":"IF((H22=\"EGG\"),'ENTRY SHEET'!F22,0)","v":0},0,null,{"$f":"'ENTRY SHEET'!M22","v":0}]
[{"$f":"'ENTRY SHEET'!B23","v":19},{"$f":"IF('ENTRY SHEET'!C23=0,\"\",'ENTRY SHEET'!C23)","v":"SUNDAY"},{"$f":"IF((H23=\"EGG\"),'ENTRY SHEET'!D23,0)","v":0},{"$f":"IF((H23=\"EGG\"),'ENTRY SHEET'!E23,0)","v":0},{"$f":"IF((H23=\"EGG\"),'ENTRY SHEET'!F23,0)","v":0},0,null,{"$f":"'ENTRY SHEET'!M23","v":0}]
[{"$f":"'ENTRY SHEET'!B24","v":20},{"$f":"IF('ENTRY SHEET'!C24=0,\"\",'ENTRY SHEET'!C24)","v":""},{"$f":"IF((H24=\"EGG\"),'ENTRY SHEET'!D24,0)","v":0},{"$f":"IF((H24=\"EGG\"),'ENTRY SHEET'!E24,0)","v":0},{"$f":"IF((H24=\"EGG\"),'ENTRY SHEET'!F24,0)","v":0},0,null,{"$f":"'ENTRY SHEET'!M24","v":0}]
[{"$f":"'ENTRY SHEET'!B25","v":21},{"$f":"IF('ENTRY SHEET'!C25=0,\"\",'ENTRY SHEET'!C25)","v":""},{"$f":"IF((H25=\"EGG\"),'ENTRY SHEET'!D25,0)","v":0},{"$f":"IF((H25=\"EGG\"),'ENTRY SHEET'!E25,0)","v":0},{"$f":"IF((H25=\"EGG\"),'ENTRY SHEET'!F25,0)","v":0},0,null,{"$f":"'ENTRY SHEET'!M25","v":0}]
[{"$f":"'ENTRY SHEET'!B26","v":22},{"$f":"IF('ENTRY SHEET'!C26=0,\"\",'ENTRY SHEET'!C26)","v":""},{"$f":"IF((H26=\"EGG\"),'ENTRY SHEET'!D26,0)","v":0},{"$f":"IF((H26=\"EGG\"),'ENTRY SHEET'!E26,0)","v":0},{"$f":"IF((H26=\"EGG\"),'ENTRY SHEET'!F26,0)","v":0},0,null,{"$f":"'ENTRY SHEET'!M26","v":0}]
[{"$f":"'ENTRY SHEET'!B27","v":23},{"$f":"IF('ENTRY SHEET'!C27=0,\"\",'ENTRY SHEET'!C27)","v":""},{"$f":"IF((H27=\"EGG\"),'ENTRY SHEET'!D27,0)","v":0},{"$f":"IF((H27=\"EGG\"),'ENTRY SHEET'!E27,0)","v":0},{"$f":"IF((H27=\"EGG\"),'ENTRY SHEET'!F27,0)","v":0},0,null,{"$f":"'ENTRY SHEET'!M27","v":0}]
[{"$f":"'ENTRY SHEET'!B28","v":24},{"$f":"IF('ENTRY SHEET'!C28=0,\"\",'ENTRY SHEET'!C28)","v":""},{"$f":"IF((H28=\"EGG\"),'ENTRY SHEET'!D28,0)","v":0},{"$f":"IF((H28=\"EGG\"),'ENTRY SHEET'!E28,0)","v":0},{"$f":"IF((H28=\"EGG\"),'ENTRY SHEET'!F28,0)","v":0},0,null,{"$f":"'ENTRY SHEET'!M28","v":0}]
[{"$f":"'ENTRY SHEET'!B29","v":25},{"$f":"IF('ENTRY SHEET'!C29=0,\"\",'ENTRY SHEET'!C29)","v":""},{"$f":"IF((H29=\"EGG\"),'ENTRY SHEET'!D29,0)","v":0},{"$f":"IF((H29=\"EGG\"),'ENTRY SHEET'!E29,0)","v":0},{"$f":"IF((H29=\"EGG\"),'ENTRY SHEET'!F29,0)","v":0},0,null,{"$f":"'ENTRY SHEET'!M29","v":0}]
[{"$f":"'ENTRY SHEET'!B30","v":26},{"$f":"IF('ENTRY SHEET'!C30=0,\"\",'ENTRY SHEET'!C30)","v":"SUNDAY"},{"$f":"IF((H30=\"EGG\"),'ENTRY SHEET'!D30,0)","v":0},{"$f":"IF((H30=\"EGG\"),'ENTRY SHEET'!E30,0)","v":0},{"$f":"IF((H30=\"EGG\"),'ENTRY SHEET'!F30,0)","v":0},0,null,{"$f":"'ENTRY SHEET'!M30","v":0}]
[{"$f":"'ENTRY SHEET'!B31","v":27},{"$f":"IF('ENTRY SHEET'!C31=0,\"\",'ENTRY SHEET'!C31)","v":""},{"$f":"IF((H31=\"EGG\"),'ENTRY SHEET'!D31,0)","v":0},{"$f":"IF((H31=\"EGG\"),'ENTRY SHEET'!E31,0)","v":0},{"$f":"IF((H31=\"EGG\"),'ENTRY SHEET'!F31,0)","v":0},0,null,{"$f":"'ENTRY SHEET'!M31","v":0}]
[{"$f":"'ENTRY SHEET'!B32","v":28},{"$f":"IF('ENTRY SHEET'!C32=0,\"\",'ENTRY SHEET'!C32)","v":""},{"$f":"IF((H32=\"EGG\"),'ENTRY SHEET'!D32,0)","v":0},{"$f":"IF((H32=\"EGG\"),'ENTRY SHEET'!E32,0)","v":0},{"$f":"IF((H32=\"EGG\"),'ENTRY SHEET'!F32,0)","v":0},0,null,{"$f":"'ENTRY SHEET'!M32","v":0}]
[{"$f":"'ENTRY SHEET'!B33","v":29},{"$f":"IF('ENTRY SHEET'!C33=0,\"\",'ENTRY SHEET'!C33)","v":""},{"$f":"IF((H33=\"EGG\"),'ENTRY SHEET'!D33,0)","v":0},{"$f":"IF((H33=\"EGG\"),'ENTRY SHEET'!E33,0)","v":0},{"$f":"IF((H33=\"EGG\"),'ENTRY SHEET'!F33,0)","v":0},0,null,{"$f":"'ENTRY SHEET'!M33","v":0}]
[{"$f":"'ENTRY SHEET'!B34","v":30},{"$f":"IF('ENTRY SHEET'!C34=0,\"\",'ENTRY SHEET'!C34)","v":""},{"$f":"IF((H34=\"EGG\"),'ENTRY SHEET'!D34,0)","v":0},{"$f":"IF((H34=\"EGG\"),'ENTRY SHEET'!E34,0)","v":0},{"$f":"IF((H34=\"EGG\"),'ENTRY SHEET'!F34,0)","v":0},0,null,{"$f":"'ENTRY SHEET'!M34","v":0}]
[{"$f":"'ENTRY SHEET'!B35","v":31},{"$f":"IF('ENTRY SHEET'!C35=0,\"\",'ENTRY SHEET'!C35)","v":""},{"$f":"IF((H35=\"EGG\"),'ENTRY SHEET'!D35,0)","v":0},{"$f":"IF((H35=\"EGG\"),'ENTRY SHEET'!E35,0)","v":0},{"$f":"IF((H35=\"EGG\"),'ENTRY SHEET'!F35,0)","v":0},0,null,{"$f":"'ENTRY SHEET'!M35","v":0}]
[{"$f":"'ENTRY SHEET'!B36","v":0},null,null,{"$f":"SUM(D5:D35)","v":0},0,{"$f":"SUM(F5:F35)","v":0}]
[]
[]
["Certified that Two(2) Eggs per week suplied to students, Rice Required for NextMonth :"]
[]
["Sign. Of the Implementing Agency  1)…………………………………………..2)…………………………………………"]
[]
[{"$f":"\"Pass Order : Sum of Rs.: \" &TEXT(F36,\"##,##,##.00\")","v":"Pass Order : Sum of Rs.: .00"},null,null,null,null,null,"Sign. Of the Head Master"]
[{"$f":"\"(Rupees \"&rswords(F36)&\")\"","v":"(Rupees Rupees Nil)"}]
["may be sanctioned & Credited into MDM implementing Agency Account",null,null,null,null,null,"Mandal Educational Officer"]

{"sheet":"9-10-MDM&EGG","index":5,"n_rows":43,"n_cols":11,"rows_kept":43,"cut":false,"hidden":false,"merged":[[0,0,0,10],[37,0,37,8],[2,0,2,5],[2,7,2,9],[1,0,1,1]]}
[{"$f":"\"MID-DAY MEALS BILL FOR THE MONTH OF \" & TEXT(MONTH,\"MMMM-YYYY\")","v":"MID-DAY MEALS BILL FOR THE MONTH OF January-2020"}]
["MANDAL :",null,{"$f":"MANDAL","v":"XYZ"},null,{"$f":"SCHOOL","v":"ZPHS ABC"},null,null,null,null,null,"HS BILL"]
[{"$f":"\" NAME OF THE IA : \"& GROUP","v":" NAME OF THE IA : ABCDEF"},null,null,null,null,null,"A/c No.:",{"$f":"ACCNO","v":1324678911}]
["DAY","Holiday","TOTAL ENROLLMENT","TOTAL PRESENT","MDM TAKEN",{"$f":"\"Amount in Rs.@ \" & COSTPERCHILDHS","v":"Amount in Rs.@ 8.18"},"Opening Balance of Rice in Kg.Gms","Rice Received during the month in Kg.Gms","Rice Utilized in Kg.Gms @150gm","Closing Balance of Rice in Kg.Gms","Menu"]
[{"$f":"'ENTRY SHEET'!B5","v":1},{"$f":"IF('ENTRY SHEET'!C5=0,\"\",'ENTRY SHEET'!C5)","v":""},{"$f":"'ENTRY SHEET'!G5","v":155},{"$f":"'ENTRY SHEET'!H5","v":0},{"$f":"'ENTRY SHEET'!I5","v":0},{"$f":"E5*COSTPERCHILDHS","v":0},{"$f":"HSBALANCE","v":110},{"$f":"'ENTRY SHEET'!K5","v":0},{"$f":"E5*0.15","v":0},{"$f":"G5+H5-I5","v":110},{"$f":"'ENTRY SHEET'!L5&IF('ENTRY SHEET'!M5=\"EGG\",\"+\"&'ENTRY SHEET'!M5,\"\")","v":""}]
[{"$f":"'ENTRY SHEET'!B6","v":2},{"$f":"IF('ENTRY SHEET'!C6=0,\"\",'ENTRY SHEET'!C6)","v":""},{"$f":"'ENTRY SHEET'!G6","v":155},{"$f":"'ENTRY SHEET'!H6","v":0},{"$f":"'ENTRY SHEET'!I6","v":0},0,{"$f":"J5","v":110},{"$f":"'ENTRY SHEET'!K6","v":0},{"$f":"E6*0.15","v":0},{"$f":"G6+H6-I6","v":110},{"$f":"'ENTRY SHEET'!L6&IF('ENTRY SHEET'!M6=\"EGG\",\"+\"&'ENTRY SHEET'!M6,\"\")","v":""}]
[{"$f":"'ENTRY SHEET'!B7","v":3},{"$f":"IF('ENTRY SHEET'!C7=0,\"\",'ENTRY SHEET'!C7)","v":""},{"$f":"'ENTRY SHEET'!G7","v":155},{"$f":"'ENTRY SHEET'!H7","v":0},{"$f":"'ENTRY SHEET'!I7","v":0},0,{"$f":"J6","v":110},{"$f":"'ENTRY SHEET'!K7","v":0},0,110,{"$f":"'ENTRY SHEET'!L7&IF('ENTRY SHEET'!M7=\"EGG\",\"+\"&'ENTRY SHEET'!M7,\"\")","v":""}]
[{"$f":"'ENTRY SHEET'!B8","v":4},{"$f":"IF('ENTRY SHEET'!C8=0,\"\",'ENTRY SHEET'!C8)","v":""},{"$f":"'ENTRY SHEET'!G8","v":155},{"$f":"'ENTRY SHEET'!H8","v":0},{"$f":"'ENTRY SHEET'!I8","v":0},0,110,{"$f":"'ENTRY SHEET'!K8","v":0},0,110,{"$f":"'ENTRY SHEET'!L8&IF('ENTRY SHEET'!M8=\"EGG\",\"+\"&'ENTRY SHEET'!M8,\"\")","v":""}]
[{"$f":"'ENTRY SHEET'!B9","v":5},{"$f":"IF('ENTRY SHEET'!C9=0,\"\",'ENTRY SHEET'!C9)","v":"SUNDAY"},{"$f":"'ENTRY SHEET'!G9","v":155},{"$f":"'ENTRY SHEET'!H9","v":0},{"$f":"'ENTRY SHEET'!I9","v":0},0,110,{"$f":"'ENTRY SHEET'!K9","v":0},0,110,{"$f":"'ENTRY SHEET'!L9&IF('ENTRY SHEET'!M9=\"EGG\",\"+\"&'ENTRY SHEET'!M9,\"\")","v":""}]
[{"$f":"'ENTRY SHEET'!B10","v":6},{"$f":"IF('ENTRY SHEET'!C10=0,\"\",'ENTRY SHEET'!C10)","v":""},{"$f":"'ENTRY SHEET'!G10","v":155},{"$f":"'ENTRY SHEET'!H10","v":0},{"$f":"'ENTRY SHEET'!I10","v":0},0,110,{"$f":"'ENTRY SHEET'!K10","v":0},0,110,{"$f":"'ENTRY SHEET'!L10&IF('ENTRY SHEET'!M10=\"EGG\",\"+\"&'ENTRY SHEET'!M10,\"\")","v":""}]
[{"$f":"'ENTRY SHEET'!B11","v":7},{"$f":"IF('ENTRY SHEET'!C11=0,\"\",'ENTRY SHEET'!C11)","v":""},{"$f":"'ENTRY SHEET'!G11","v":155},{"$f":"'ENTRY SHEET'!H11","v":0},{"$f":"'ENTRY SHEET'!I11","v":0},0,110,{"$f":"'ENTRY SHEET'!K11","v":0},0,110,{"$f":"'ENTRY SHEET'!L11&IF('ENTRY SHEET'!M11=\"EGG\",\"+\"&'ENTRY SHEET'!M11,\"\")","v":""}]
[{"$f":"'ENTRY SHEET'!B12","v":8},{"$f":"IF('ENTRY SHEET'!C12=0,\"\",'ENTRY SHEET'!C12)","v":""},{"$f":"'ENTRY SHEET'!G12","v":155},{"$f":"'ENTRY SHEET'!H12","v":0},{"$f":"'ENTRY SHEET'!I12","v":0},0,110,{"$f":"'ENTRY SHEET'!K12","v":0},0,110,{"$f":"'ENTRY SHEET'!L12&IF('ENTRY SHEET'!M12=\"EGG\",\"+\"&'ENTRY SHEET'!M12,\"\")","v":""}]
[{"$f":"'ENTRY SHEET'!B13","v":9},{"$f":"IF('ENTRY SHEET'!C13=0,\"\",'ENTRY SHEET'!C13)","v":""},{"$f":"'ENTRY SHEET'!G13","v":155},{"$f":"'ENTRY SHEET'!H13","v":0},{"$f":"'ENTRY SHEET'!I13","v":0},0,110,{"$f":"'ENTRY SHEET'!K13","v":0},0,110,{"$f":"'ENTRY SHEET'!L13&IF('ENTRY SHEET'!M13=\"EGG\",\"+\"&'ENTRY SHEET'!M13,\"\")","v":""}]
[{"$f":"'ENTRY SHEET'!B14","v":10},{"$f":"IF('ENTRY SHEET'!C14=0,\"\",'ENTRY SHEET'!C14)","v":""},{"$f":"'ENTRY SHEET'!G14","v":155},{"$f":"'ENTRY SHEET'!H14","v":0},{"$f":"'ENTRY SHEET'!I14","v":0},0,110,{"$f":"'ENTRY SHEET'!K14","v":0},0,110,{"$f":"'ENTRY SHEET'!L14&IF('ENTRY SHEET'!M14=\"EGG\",\"+\"&'ENTRY SHEET'!M14,\"\")","v":""}]
[{"$f":"'ENTRY SHEET'!B15","v":11},{"$f":"IF('ENTRY SHEET'!C15=0,\"\",'ENTRY SHEET'!C15)","v":""},{"$f":"'ENTRY SHEET'!G15","v":155},{"$f":"'ENTRY SHEET'!H15","v":0},{"$f":"'ENTRY SHEET'!I15","v":0},0,110,{"$f":"'ENTRY SHEET'!K15","v":0},0,110,{"$f":"'ENTRY SHEET'!L15&IF('ENTRY SHEET'!M15=\"EGG\",\"+\"&'ENTRY SHEET'!M15,\"\")","v":""}]
[{"$f":"'ENTRY SHEET'!B16","v":12},{"$f":"IF('ENTRY SHEET'!C16=0,\"\",'ENTRY SHEET'!C16)","v":"SUNDAY"},{"$f":"'ENTRY SHEET'!G16","v":155},{"$f":"'ENTRY SHEET'!H16","v":0},{"$f":"'ENTRY SHEET'!I16","v":0},0,110,{"$f":"'ENTRY SHEET'!K16","v":0},0,110,{"$f":"'ENTRY SHEET'!L16&IF('ENTRY SHEET'!M16=\"EGG\",\"+\"&'ENTRY SHEET'!M16,\"\")","v":""}]
[{"$f":"'ENTRY SHEET'!B17","v":13},{"$f":"IF('ENTRY SHEET'!C17=0,\"\",'ENTRY SHEET'!C17)","v":""},{"$f":"'ENTRY SHEET'!G17","v":155},{"$f":"'ENTRY SHEET'!H17","v":0},{"$f":"'ENTRY SHEET'!I17","v":0},0,110,{"$f":"'ENTRY SHEET'!K17","v":0},0,110,{"$f":"'ENTRY SHEET'!L17&IF('ENTRY SHEET'!M17=\"EGG\",\"+\"&'ENTRY SHEET'!M17,\"\")","v":""}]
[{"$f":"'ENTRY SHEET'!B18","v":14},{"$f":"IF('ENTRY SHEET'!C18=0,\"\",'ENTRY SHEET'!C18)","v":""},{"$f":"'ENTRY SHEET'!G18","v":155},{"$f":"'ENTRY SHEET'!H18","v":0},{"$f":"'ENTRY SHEET'!I18","v":0},0,110,{"$f":"'ENTRY SHEET'!K18","v":0},0,110,{"$f":"'ENTRY SHEET'!L18&IF('ENTRY SHEET'!M18=\"EGG\",\"+\"&'ENTRY SHEET'!M18,\"\")","v":""}]
[{"$f":"'ENTRY SHEET'!B19","v":15},{"$f":"IF('ENTRY SHEET'!C19=0,\"\",'ENTRY SHEET'!C19)","v":""},{"$f":"'ENTRY SHEET'!G19","v":155},{"$f":"'ENTRY SHEET'!H19","v":0},{"$f":"'ENTRY SHEET'!I19","v":0},0,110,{"$f":"'ENTRY SHEET'!K19","v":0},0,110,{"$f":"'ENTRY SHEET'!L19&IF('ENTRY SHEET'!M19=\"EGG\",\"+\"&'ENTRY SHEET'!M19,\"\")","v":""}]
[{"$f":"'ENTRY SHEET'!B20","v":16},{"$f":"IF('ENTRY SHEET'!C20=0,\"\",'ENTRY SHEET'!C20)","v":""},166,{"$f":"'ENTRY SHEET'!H20","v":0},{"$f":"'ENTRY SHEET'!I20","v":0},0,110,{"$f":"'ENTRY SHEET'!K20","v":0},0,110,{"$f":"'ENTRY SHEET'!L20&IF('ENTRY SHEET'!M20=\"EGG\",\"+\"&'ENTRY SHEET'!M20,\"\")","v":""}]
[{"$f":"'ENTRY SHEET'!B21","v":17},{"$f":"IF('ENTRY SHEET'!C21=0,\"\",'ENTRY SHEET'!C21)","v":""},{"$f":"'ENTRY SHEET'!G21","v":213},{"$f":"'ENTRY SHEET'!H21","v":0},{"$f":"'ENTRY SHEET'!I21","v":0},0,110,{"$f":"'ENTRY SHEET'!K21","v":0},0,110,{"$f":"'ENTRY SHEET'!L21&IF('ENTRY SHEET'!M21=\"EGG\",\"+\"&'ENTRY SHEET'!M21,\"\")","v":""}]
[{"$f":"'ENTRY SHEET'!B22","v":18},{"$f":"IF('ENTRY SHEET'!C22=0,\"\",'ENTRY SHEET'!C22)","v":""},{"$f":"'ENTRY SHEET'!G22","v":213},{"$f":"'ENTRY SHEET'!H22","v":0},{"$f":"'ENTRY SHEET'!I22","v":0},0,110,{"$f":"'ENTRY SHEET'!K22","v":0},0,110,{"$f":"'ENTRY SHEET'!L22&IF('ENTRY SHEET'!M22=\"EGG\",\"+\"&'ENTRY SHEET'!M22,\"\")","v":""}]
[{"$f":"'ENTRY SHEET'!B23","v":19},{"$f":"IF('ENTRY SHEET'!C23=0,\"\",'ENTRY SHEET'!C23)","v":"SUNDAY"},{"$f":"'ENTRY SHEET'!G23","v":213},{"$f":"'ENTRY SHEET'!H23","v":0},{"$f":"'ENTRY SHEET'!I23","v":0},0,110,{"$f":"'ENTRY SHEET'!K23","v":0},0,110,{"$f":"'ENTRY SHEET'!L23&IF('ENTRY SHEET'!M23=\"EGG\",\"+\"&'ENTRY SHEET'!M23,\"\")","v":""}]
[{"$f":"'ENTRY SHEET'!B24","v":20},{"$f":"IF('ENTRY SHEET'!C24=0,\"\",'ENTRY SHEET'!C24)","v":""},{"$f":"'ENTRY SHEET'!G24","v":213},{"$f":"'ENTRY SHEET'!H24","v":0},{"$f":"'ENTRY SHEET'!I24","v":0},0,110,{"$f":"'ENTRY SHEET'!K24","v":0},0,110,{"$f":"'ENTRY SHEET'!L24&IF('ENTRY SHEET'!M24=\"EGG\",\"+\"&'ENTRY SHEET'!M24,\"\")","v":""}]
[{"$f":"'ENTRY SHEET'!B25","v":21},{"$f":"IF('ENTRY SHEET'!C25=0,\"\",'ENTRY SHEET'!C25)","v":""},{"$f":"'ENTRY SHEET'!G25","v":213},{"$f":"'ENTRY SHEET'!H25","v":0},{"$f":"'ENTRY SHEET'!I25","v":0},0,110,{"$f":"'ENTRY SHEET'!K25","v":0},0,110,{"$f":"'ENTRY SHEET'!L25&IF('ENTRY SHEET'!M25=\"EGG\",\"+\"&'ENTRY SHEET'!M25,\"\")","v":""}]
[{"$f":"'ENTRY SHEET'!B26","v":22},{"$f":"IF('ENTRY SHEET'!C26=0,\"\",'ENTRY SHEET'!C26)","v":""},{"$f":"'ENTRY SHEET'!G26","v":213},{"$f":"'ENTRY SHEET'!H26","v":0},{"$f":"'ENTRY SHEET'!I26","v":0},0,110,{"$f":"'ENTRY SHEET'!K26","v":0},0,110,{"$f":"'ENTRY SHEET'!L26&IF('ENTRY SHEET'!M26=\"EGG\",\"+\"&'ENTRY SHEET'!M26,\"\")","v":""}]
[{"$f":"'ENTRY SHEET'!B27","v":23},{"$f":"IF('ENTRY SHEET'!C27=0,\"\",'ENTRY SHEET'!C27)","v":""},152,{"$f":"'ENTRY SHEET'!H27","v":0},{"$f":"'ENTRY SHEET'!I27","v":0},0,110,{"$f":"'ENTRY SHEET'!K27","v":0},0,110,{"$f":"'ENTRY SHEET'!L27&IF('ENTRY SHEET'!M27=\"EGG\",\"+\"&'ENTRY SHEET'!M27,\"\")","v":""}]
[{"$f":"'ENTRY SHEET'!B28","v":24},{"$f":"IF('ENTRY SHEET'!C28=0,\"\",'ENTRY SHEET'!C28)","v":""},{"$f":"'ENTRY SHEET'!G28","v":213},{"$f":"'ENTRY SHEET'!H28","v":0},{"$f":"'ENTRY SHEET'!I28","v":0},0,110,{"$f":"'ENTRY SHEET'!K28","v":0},0,110,{"$f":"'ENTRY SHEET'!L28&IF('ENTRY SHEET'!M28=\"EGG\",\"+\"&'ENTRY SHEET'!M28,\"\")","v":""}]
[{"$f":"'ENTRY SHEET'!B29","v":25},{"$f":"IF('ENTRY SHEET'!C29=0,\"\",'ENTRY SHEET'!C29)","v":""},{"$f":"'ENTRY SHEET'!G29","v":213},{"$f":"'ENTRY SHEET'!H29","v":0},{"$f":"'ENTRY SHEET'!I29","v":0},0,110,{"$f":"'ENTRY SHEET'!K29","v":0},0,110,{"$f":"'ENTRY SHEET'!L29&IF('ENTRY SHEET'!M29=\"EGG\",\"+\"&'ENTRY SHEET'!M29,\"\")","v":""}]
[{"$f":"'ENTRY SHEET'!B30","v":26},{"$f":"IF('ENTRY SHEET'!C30=0,\"\",'ENTRY SHEET'!C30)","v":"SUNDAY"},{"$f":"'ENTRY SHEET'!G30","v":213},{"$f":"'ENTRY SHEET'!H30","v":0},{"$f":"'ENTRY SHEET'!I30","v":0},0,110,{"$f":"'ENTRY SHEET'!K30","v":0},0,110,{"$f":"'ENTRY SHEET'!L30&IF('ENTRY SHEET'!M30=\"EGG\",\"+\"&'ENTRY SHEET'!M30,\"\")","v":""}]
[{"$f":"'ENTRY SHEET'!B31","v":27},{"$f":"IF('ENTRY SHEET'!C31=0,\"\",'ENTRY SHEET'!C31)","v":""},{"$f":"'ENTRY SHEET'!G31","v":213},{"$f":"'ENTRY SHEET'!H31","v":0},{"$f":"'ENTRY SHEET'!I31","v":0},0,110,{"$f":"'ENTRY SHEET'!K31","v":0},0,110,{"$f":"'ENTRY SHEET'!L31&IF('ENTRY SHEET'!M31=\"EGG\",\"+\"&'ENTRY SHEET'!M31,\"\")","v":""}]
[{"$f":"'ENTRY SHEET'!B32","v":28},{"$f":"IF('ENTRY SHEET'!C32=0,\"\",'ENTRY SHEET'!C32)","v":""},{"$f":"'ENTRY SHEET'!G32","v":213},{"$f":"'ENTRY SHEET'!H32","v":0},{"$f":"'ENTRY SHEET'!I32","v":0},0,110,{"$f":"'ENTRY SHEET'!K32","v":0},0,110,{"$f":"'ENTRY SHEET'!L32&IF('ENTRY SHEET'!M32=\"EGG\",\"+\"&'ENTRY SHEET'!M32,\"\")","v":""}]
[{"$f":"'ENTRY SHEET'!B33","v":29},{"$f":"IF('ENTRY SHEET'!C33=0,\"\",'ENTRY SHEET'!C33)","v":""},{"$f":"'ENTRY SHEET'!G33","v":213},{"$f":"'ENTRY SHEET'!H33","v":0},{"$f":"'ENTRY SHEET'!I33","v":0},0,110,{"$f":"'ENTRY SHEET'!K33","v":0},0,110,{"$f":"'ENTRY SHEET'!L33&IF('ENTRY SHEET'!M33=\"EGG\",\"+\"&'ENTRY SHEET'!M33,\"\")","v":""}]
[{"$f":"'ENTRY SHEET'!B34","v":30},{"$f":"IF('ENTRY SHEET'!C34=0,\"\",'ENTRY SHEET'!C34)","v":""},{"$f":"'ENTRY SHEET'!G34","v":213},{"$f":"'ENTRY SHEET'!H34","v":0},{"$f":"'ENTRY SHEET'!I34","v":0},0,110,{"$f":"'ENTRY SHEET'!K34","v":0},0,110,{"$f":"'ENTRY SHEET'!L34&IF('ENTRY SHEET'!M34=\"EGG\",\"+\"&'ENTRY SHEET'!M34,\"\")","v":""}]
[{"$f":"'ENTRY SHEET'!B35","v":31},{"$f":"IF('ENTRY SHEET'!C35=0,\"\",'ENTRY SHEET'!C35)","v":""},{"$f":"'ENTRY SHEET'!G35","v":213},{"$f":"'ENTRY SHEET'!H35","v":0},{"$f":"'ENTRY SHEET'!I35","v":0},0,110,{"$f":"'ENTRY SHEET'!K35","v":0},0,{"$f":"G35+H35-I35","v":110},{"$f":"'ENTRY SHEET'!L35&IF('ENTRY SHEET'!M35=\"EGG\",\"+\"&'ENTRY SHEET'!M35,\"\")","v":""}]
[{"$f":"'ENTRY SHEET'!B36","v":0},null,null,{"$f":"SUM(D5:D35)","v":0},0,{"$f":"SUM(F5:F35)","v":0},null,{"$f":"SUM(H5:H35)","v":0},{"$f":"SUM(I5:I35)","v":0},{"$f":"J35","v":110}]
[]
["Certified that Two(2) Eggs per week suplied to students, Rice Required for NextMonth :",null,null,null,null,null,null,null,null,{"$f":"HSRICE & \" KG\"","v":"600 KG"}]
["Sign. Of the Implementing Agency  1)…………………………………………..2)…………………………………………"]
[null,null,null,null,null,null,null,null,"Sign. Of the Head Master"]
[{"$f":"\"Pass Order : Sum of Rs.: \" &TEXT(F36,\"##,##,##.00\")","v":"Pass Order : Sum of Rs.: .00"}]
[{"$f":"\"(Rupees \"&rswords(F36)&\")\"","v":"(Rupees Rupees Nil)"}]
["may be sanctioned & Credited into MDM implementing Agency Account",null,null,null,null,null,null,null,"Mandal Educational Officer"]

{"sheet":"RICE ACCOUNT","index":6,"n_rows":37,"n_cols":17,"rows_kept":37,"cut":false,"hidden":false,"merged":[[0,0,0,13],[1,11,1,12],[1,13,1,15],[1,1,1,2],[1,4,1,10],[2,0,4,0],[2,1,2,3],[2,5,2,7],[2,13,2,15],[2,10,2,12],[2,4,36,4],[2,8,36,8],[2,9,36,9]]}
["MID-DAY MEALS PROGRAMME - RICE ACCOUNT"]
["MANDAL",{"$f":"MANDAL","v":"XYZ"},null,"SCHOOL",{"$f":"SCHOOL","v":"ZPHS ABC"},null,null,null,null,null,null,"MONTH",null,{"$f":"MONTH","v":"2020-01-01"}]
["DATE","OPENING BALANCE",null,null,null,"RICE RECEIVED / RETURNED",null,null,null,null,"RICE UTILIZED",null,null,"GROUND BALANCE"]
[]
[null,"UPS","HS","TOTAL",null,"UPS","HS","TOTAL RECEIVED",null,null,"UPS","HS","TOTAL","UPS","HS","TOTAL"]
[1,{"$f":"'6-8-MDMonthly'!$G5","v":120},{"$f":"'9-10-MDM&EGG'!$G5","v":110},{"$f":"SUM(B6:C6)","v":230},null,{"$f":"'ENTRY SHEET'!J5","v":0},{"$f":"'ENTRY SHEET'!K5","v":0},{"$f":"SUM(F6:G6)","v":0},null,null,{"$f":"'6-8-MDMonthly'!$I5","v":0},{"$f":"'9-10-MDM&EGG'!$I5","v":0},{"$f":"SUM(K6:L6)","v":0},{"$f":"B6+F6-K6","v":120},{"$f":"C6+G6-L6","v":110},{"$f":"SUM(N6:O6)","v":230}]
[2,{"$f":"'6-8-MDMonthly'!$G6","v":120},{"$f":"'9-10-MDM&EGG'!$G6","v":110},{"$f":"SUM(B7:C7)","v":230},null,{"$f":"'ENTRY SHEET'!J6","v":0},{"$f":"'ENTRY SHEET'!K6","v":0},{"$f":"SUM(F7:G7)","v":0},null,null,{"$f":"'6-8-MDMonthly'!$I6","v":0},{"$f":"'9-10-MDM&EGG'!$I6","v":0},{"$f":"SUM(K7:L7)","v":0},{"$f":"B7+F7-K7","v":120},{"$f":"C7+G7-L7","v":110},{"$f":"SUM(N7:O7)","v":230}]
[3,{"$f":"'6-8-MDMonthly'!$G7","v":120},{"$f":"'9-10-MDM&EGG'!$G7","v":110},230,null,{"$f":"'ENTRY SHEET'!J7","v":0},{"$f":"'ENTRY SHEET'!K7","v":0},0,null,null,{"$f":"'6-8-MDMonthly'!$I7","v":0},{"$f":"'9-10-MDM&EGG'!$I7","v":0},0,120,110,{"$f":"SUM(N8:O8)","v":230}]
[4,{"$f":"'6-8-MDMonthly'!$G8","v":120},{"$f":"'9-10-MDM&EGG'!$G8","v":110},230,null,{"$f":"'ENTRY SHEET'!J8","v":0},{"$f":"'ENTRY SHEET'!K8","v":0},0,null,null,{"$f":"'6-8-MDMonthly'!$I8","v":0},{"$f":"'9-10-MDM&EGG'!$I8","v":0},0,{"$f":"B9+F9-K9","v":120},110,230]
[5,{"$f":"'6-8-MDMonthly'!$G9","v":120},{"$f":"'9-10-MDM&EGG'!$G9","v":110},230,null,{"$f":"'ENTRY SHEET'!J9","v":0},{"$f":"'ENTRY SHEET'!K9","v":0},0,null,null,{"$f":"'6-8-MDMonthly'!$I9","v":0},{"$f":"'9-10-MDM&EGG'!$I9","v":0},0,120,110,230]
[6,{"$f":"'6-8-MDMonthly'!$G10","v":120},{"$f":"'9-10-MDM&EGG'!$G10","v":110},230,null,{"$f":"'ENTRY SHEET'!J10","v":0},{"$f":"'ENTRY SHEET'!K10","v":0},0,null,null,{"$f":"'6-8-MDMonthly'!$I10","v":0},{"$f":"'9-10-MDM&EGG'!$I10","v":0},0,120,110,230]
[7,{"$f":"'6-8-MDMonthly'!$G11","v":120},{"$f":"'9-10-MDM&EGG'!$G11","v":110},230,null,{"$f":"'ENTRY SHEET'!J11","v":0},{"$f":"'ENTRY SHEET'!K11","v":0},0,null,null,{"$f":"'6-8-MDMonthly'!$I11","v":0},{"$f":"'9-10-MDM&EGG'!$I11","v":0},0,120,110,230]
[8,{"$f":"'6-8-MDMonthly'!$G12","v":120},{"$f":"'9-10-MDM&EGG'!$G12","v":110},230,null,{"$f":"'ENTRY SHEET'!J12","v":0},{"$f":"'ENTRY SHEET'!K12","v":0},0,null,null,{"$f":"'6-8-MDMonthly'!$I12","v":0},{"$f":"'9-10-MDM&EGG'!$I12","v":0},0,120,110,230]
[9,{"$f":"'6-8-MDMonthly'!$G13","v":120},{"$f":"'9-10-MDM&EGG'!$G13","v":110},230,null,{"$f":"'ENTRY SHEET'!J13","v":0},{"$f":"'ENTRY SHEET'!K13","v":0},0,null,null,{"$f":"'6-8-MDMonthly'!$I13","v":0},{"$f":"'9-10-MDM&EGG'!$I13","v":0},0,120,110,230]
[10,{"$f":"'6-8-MDMonthly'!$G14","v":120},{"$f":"'9-10-MDM&EGG'!$G14","v":110},230,null,{"$f":"'ENTRY SHEET'!J14","v":0},{"$f":"'ENTRY SHEET'!K14","v":0},0,null,null,{"$f":"'6-8-MDMonthly'!$I14","v":0},{"$f":"'9-10-MDM&EGG'!$I14","v":0},0,120,110,230]
[11,{"$f":"'6-8-MDMonthly'!$G15","v":120},{"$f":"'9-10-MDM&EGG'!$G15","v":110},230,null,{"$f":"'ENTRY SHEET'!J15","v":0},{"$f":"'ENTRY SHEET'!K15","v":0},0,null,null,{"$f":"'6-8-MDMonthly'!$I15","v":0},{"$f":"'9-10-MDM&EGG'!$I15","v":0},0,120,110,230]
[12,{"$f":"'6-8-MDMonthly'!$G16","v":120},{"$f":"'9-10-MDM&EGG'!$G16","v":110},230,null,{"$f":"'ENTRY SHEET'!J16","v":0},{"$f":"'ENTRY SHEET'!K16","v":0},0,null,null,{"$f":"'6-8-MDMonthly'!$I16","v":0},{"$f":"'9-10-MDM&EGG'!$I16","v":0},0,120,110,230]
[13,{"$f":"'6-8-MDMonthly'!$G17","v":120},{"$f":"'9-10-MDM&EGG'!$G17","v":110},230,null,{"$f":"'ENTRY SHEET'!J17","v":0},{"$f":"'ENTRY SHEET'!K17","v":0},0,null,null,{"$f":"'6-8-MDMonthly'!$I17","v":0},{"$f":"'9-10-MDM&EGG'!$I17","v":0},0,120,110,230]
[14,{"$f":"'6-8-MDMonthly'!$G18","v":120},{"$f":"'9-10-MDM&EGG'!$G18","v":110},230,null,{"$f":"'ENTRY SHEET'!J18","v":0},{"$f":"'ENTRY SHEET'!K18","v":0},0,null,null,{"$f":"'6-8-MDMonthly'!$I18","v":0},{"$f":"'9-10-MDM&EGG'!$I18","v":0},0,120,110,230]
[15,{"$f":"'6-8-MDMonthly'!$G19","v":120},{"$f":"'9-10-MDM&EGG'!$G19","v":110},230,null,{"$f":"'ENTRY SHEET'!J19","v":0},{"$f":"'ENTRY SHEET'!K19","v":0},0,null,null,{"$f":"'6-8-MDMonthly'!$I19","v":0},{"$f":"'9-10-MDM&EGG'!$I19","v":0},0,120,110,230]
[16,{"$f":"'6-8-MDMonthly'!$G20","v":120},{"$f":"'9-10-MDM&EGG'!$G20","v":110},230,null,{"$f":"'ENTRY SHEET'!J20","v":0},{"$f":"'ENTRY SHEET'!K20","v":0},0,null,null,{"$f":"'6-8-MDMonthly'!$I20","v":0},{"$f":"'9-10-MDM&EGG'!$I20","v":0},0,120,110,230]
[17,{"$f":"'6-8-MDMonthly'!$G21","v":120},{"$f":"'9-10-MDM&EGG'!$G21","v":110},230,null,{"$f":"'ENTRY SHEET'!J21","v":0},{"$f":"'ENTRY SHEET'!K21","v":0},0,null,null,{"$f":"'6-8-MDMonthly'!$I21","v":0},{"$f":"'9-10-MDM&EGG'!$I21","v":0},0,120,110,230]
[18,{"$f":"'6-8-MDMonthly'!$G22","v":120},{"$f":"'9-10-MDM&EGG'!$G22","v":110},230,null,{"$f":"'ENTRY SHEET'!J22","v":0},{"$f":"'ENTRY SHEET'!K22","v":0},0,null,null,{"$f":"'6-8-MDMonthly'!$I22","v":0},{"$f":"'9-10-MDM&EGG'!$I22","v":0},0,120,110,230]
[19,{"$f":"'6-8-MDMonthly'!$G23","v":120},{"$f":"'9-10-MDM&EGG'!$G23","v":110},230,null,{"$f":"'ENTRY SHEET'!J23","v":0},{"$f":"'ENTRY SHEET'!K23","v":0},0,null,null,{"$f":"'6-8-MDMonthly'!$I23","v":0},{"$f":"'9-10-MDM&EGG'!$I23","v":0},0,120,110,230]
[20,{"$f":"'6-8-MDMonthly'!$G24","v":120},{"$f":"'9-10-MDM&EGG'!$G24","v":110},230,null,{"$f":"'ENTRY SHEET'!J24","v":0},{"$f":"'ENTRY SHEET'!K24","v":0},0,null,null,{"$f":"'6-8-MDMonthly'!$I24","v":0},{"$f":"'9-10-MDM&EGG'!$I24","v":0},0,120,110,230]
[21,{"$f":"'6-8-MDMonthly'!$G25","v":120},{"$f":"'9-10-MDM&EGG'!$G25","v":110},230,null,{"$f":"'ENTRY SHEET'!J25","v":0},{"$f":"'ENTRY SHEET'!K25","v":0},0,null,null,{"$f":"'6-8-MDMonthly'!$I25","v":0},{"$f":"'9-10-MDM&EGG'!$I25","v":0},0,120,110,230]
[22,{"$f":"'6-8-MDMonthly'!$G26","v":120},{"$f":"'9-10-MDM&EGG'!$G26","v":110},230,null,{"$f":"'ENTRY SHEET'!J26","v":0},{"$f":"'ENTRY SHEET'!K26","v":0},0,null,null,{"$f":"'6-8-MDMonthly'!$I26","v":0},{"$f":"'9-10-MDM&EGG'!$I26","v":0},0,120,110,230]
[23,{"$f":"'6-8-MDMonthly'!$G27","v":120},{"$f":"'9-10-MDM&EGG'!$G27","v":110},230,null,{"$f":"'ENTRY SHEET'!J27","v":0},{"$f":"'ENTRY SHEET'!K27","v":0},0,null,null,{"$f":"'6-8-MDMonthly'!$I27","v":0},{"$f":"'9-10-MDM&EGG'!$I27","v":0},0,120,110,230]
[24,{"$f":"'6-8-MDMonthly'!$G28","v":120},{"$f":"'9-10-MDM&EGG'!$G28","v":110},230,null,{"$f":"'ENTRY SHEET'!J28","v":0},{"$f":"'ENTRY SHEET'!K28","v":0},0,null,null,{"$f":"'6-8-MDMonthly'!$I28","v":0},{"$f":"'9-10-MDM&EGG'!$I28","v":0},0,120,110,230]
[25,{"$f":"'6-8-MDMonthly'!$G29","v":120},{"$f":"'9-10-MDM&EGG'!$G29","v":110},230,null,{"$f":"'ENTRY SHEET'!J29","v":0},{"$f":"'ENTRY SHEET'!K29","v":0},0,null,null,{"$f":"'6-8-MDMonthly'!$I29","v":0},{"$f":"'9-10-MDM&EGG'!$I29","v":0},0,120,110,230]
[26,{"$f":"'6-8-MDMonthly'!$G30","v":120},{"$f":"'9-10-MDM&EGG'!$G30","v":110},230,null,{"$f":"'ENTRY SHEET'!J30","v":0},{"$f":"'ENTRY SHEET'!K30","v":0},0,null,null,{"$f":"'6-8-MDMonthly'!$I30","v":0},{"$f":"'9-10-MDM&EGG'!$I30","v":0},0,120,110,{"$f":"SUM(N31:O31)","v":230}]
[27,{"$f":"'6-8-MDMonthly'!$G31","v":120},{"$f":"'9-10-MDM&EGG'!$G31","v":110},230,null,{"$f":"'ENTRY SHEET'!J31","v":0},{"$f":"'ENTRY SHEET'!K31","v":0},0,null,null,{"$f":"'6-8-MDMonthly'!$I31","v":0},{"$f":"'9-10-MDM&EGG'!$I31","v":0},0,120,110,{"$f":"SUM(N32:O32)","v":230}]
[28,{"$f":"'6-8-MDMonthly'!$G32","v":120},{"$f":"'9-10-MDM&EGG'!$G32","v":110},230,null,{"$f":"'ENTRY SHEET'!J32","v":0},{"$f":"'ENTRY SHEET'!K32","v":0},0,null,null,{"$f":"'6-8-MDMonthly'!$I32","v":0},{"$f":"'9-10-MDM&EGG'!$I32","v":0},0,120,110,230]
[29,{"$f":"'6-8-MDMonthly'!$G33","v":120},{"$f":"'9-10-MDM&EGG'!$G33","v":110},230,null,{"$f":"'ENTRY SHEET'!J33","v":0},{"$f":"'ENTRY SHEET'!K33","v":0},0,null,null,{"$f":"'6-8-MDMonthly'!$I33","v":0},{"$f":"'9-10-MDM&EGG'!$I33","v":0},0,120,110,230]
[30,{"$f":"'6-8-MDMonthly'!$G34","v":120},{"$f":"'9-10-MDM&EGG'!$G34","v":110},230,null,{"$f":"'ENTRY SHEET'!J34","v":0},{"$f":"'ENTRY SHEET'!K34","v":0},0,null,null,{"$f":"'6-8-MDMonthly'!$I34","v":0},{"$f":"'9-10-MDM&EGG'!$I34","v":0},0,120,110,230]
[31,{"$f":"'6-8-MDMonthly'!$G35","v":120},{"$f":"'9-10-MDM&EGG'!$G35","v":110},230,null,{"$f":"'ENTRY SHEET'!J35","v":0},{"$f":"'ENTRY SHEET'!K35","v":0},0,null,null,{"$f":"'6-8-MDMonthly'!$I35","v":0},{"$f":"'9-10-MDM&EGG'!$I35","v":0},0,120,110,230]
[null,null,null,null,null,{"$f":"SUM(F6:F36)","v":0},{"$f":"SUM(G6:G36)","v":0},{"$f":"SUM(H6:H36)","v":0},null,null,{"$f":"SUM(K6:K36)","v":0},{"$f":"SUM(L6:L36)","v":0},{"$f":"SUM(K37:L37)","v":0},null,null,null,{"$f":"SUM(Q6:Q36)","v":0}]

{"sheet":"TOTALS-LS","index":7,"n_rows":59,"n_cols":29,"rows_kept":59,"cut":false,"hidden":true,"merged":[[40,27,40,28],[0,0,0,27],[2,26,2,27],[1,26,1,27],[39,0,39,3],[39,5,39,7],[39,9,39,11],[2,1,2,3],[2,5,2,7],[2,22,2,24],[2,9,2,11],[1,2,1,7],[40,0,40,3],[40,5,40,7],[40,9,40,11],[2,16,2,18],[1,9,1,19],[4,1,4,15],[2,0,4,0],[4,22,4,24],[39,27,39,28],[4,17,4,18],[2,19,2,21],[4,19,4,20],[1,20,1,24],[2,13,2,15],[39,13,39,14],[40,13,40,14],[39,15,39,16],[40,15,40,16],[39,21,39,22],[40,21,40,22],[39,17,39,18],[39,19,39,20],[40,17,40,18],[40,19,40,20]]}
["MID-DAY MEALS PROGRAMME"]
[null,null,{"$f":"\"MANDAL : \" & MANDAL","v":"MANDAL : XYZ"},null,null,null,null,null,null,{"$f":"\"SCHOOL : \" & SCHOOL","v":"SCHOOL : ZPHS ABC"},null,null,null,null,null,null,null,null,null,null,{"$f":"\"MONTH:\" & MONTH","v":"MONTH:43831"},null,null,null,null,null,{"$f":"MONTH","v":43831},null,{"$f":"MONTH","v":43831}]
["DATE","ENROLLED",null,null,null,"PRSENT",null,null,null,"MDM TAKEN",null,null,null,"RICE GIVEN",null,null,"RICE ACCOUNT",null,null,"RICE RECEIVED / RETURNED",null,null,"AMOUNT",null,null,null,"RICE RECEIVED",null,"MENU"]
[null,"UPS","HS","TOTAL",null,"UPS","HS","TOTAL",null,"UPS","HS","TOTAL",null,"UPS RICE","HS RICE","TOTAL RICE","OPENING BALANCE","GIVEN","BALANCE","UPS","HS","TOAL","UPS","HS","TOTAL",null,"UPS","HS"]
[null,"LAST MONTH RICE BALANCE ------->",null,null,null,null,null,null,null,null,null,null,null,null,null,null,{"$f":"'RICE ACCOUNT'!$D$6","v":230},null,null,null,null,null,{"$f":"COSTPCHILDUPS","v":6.18}]
[1,{"$f":"#REF!","v":{"$error":"#REF!"}},{"$f":"'9-10-MDM&EGG'!C5","v":155},{"$f":"SUM(B6:C6)","v":{"$error":"#REF!"}},null,{"$f":"#REF!","v":{"$error":"#REF!"}},{"$f":"'9-10-MDM&EGG'!D5","v":0},{"$f":"SUM(F6:G6)","v":{"$error":"#REF!"}},null,{"$f":"#REF!","v":{"$error":"#REF!"}},{"$f":"'9-10-MDM&EGG'!E5","v":0},{"$f":"SUM(J6:K6)","v":{"$error":"#REF!"}},null,{"$f":"J6*150/1000","v":{"$error":"#REF!"}},{"$f":"K6*150/1000","v":0},{"$f":"N6+O6","v":{"$error":"#REF!"}},{"$f":"Q5","v":230},{"$f":"(J6*150/1000)+(K6*150/1000)","v":{"$error":"#REF!"}},{"$f":"Q6-R6","v":{"$error":"#REF!"}},{"$f":"'RICE ACCOUNT'!F6","v":0},{"$f":"'RICE ACCOUNT'!G6","v":0},{"$f":"SUM(T6:U6)","v":0},{"$f":"J6*COSTPCHILDUPS","v":{"$error":"#REF!"}},{"$f":"K6*COSTPCHILDUPS","v":0},{"$f":"SUM(W6:X6)","v":{"$error":"#REF!"}},null,{"$f":"'RICE ACCOUNT'!F6","v":0},{"$f":"'RICE ACCOUNT'!G6","v":0}]
[2,{"$f":"#REF!","v":{"$error":"#REF!"}},{"$f":"'9-10-MDM&EGG'!C6","v":155},{"$f":"SUM(B7:C7)","v":{"$error":"#REF!"}},null,{"$f":"#REF!","v":{"$error":"#REF!"}},{"$f":"'9-10-MDM&EGG'!D6","v":0},{"$f":"SUM(F7:G7)","v":{"$error":"#REF!"}},null,{"$f":"#REF!","v":{"$error":"#REF!"}},{"$f":"'9-10-MDM&EGG'!E6","v":0},{"$f":"SUM(J7:K7)","v":{"$error":"#REF!"}},null,{"$f":"J7*150/1000","v":{"$error":"#REF!"}},{"$f":"K7*150/1000","v":0},{"$f":"N7+O7","v":{"$error":"#REF!"}},{"$f":"S6+V6","v":{"$error":"#REF!"}},{"$f":"(J7*150/1000)+(K7*150/1000)","v":{"$error":"#REF!"}},{"$f":"Q7-R7","v":{"$error":"#REF!"}},{"$f":"'RICE ACCOUNT'!F7","v":0},{"$f":"'RICE ACCOUNT'!G7","v":0},{"$f":"SUM(T7:U7)","v":0},{"$f":"J7*COSTPCHILDUPS","v":{"$error":"#REF!"}},{"$f":"K7*COSTPCHILDUPS","v":0},{"$f":"SUM(W7:X7)","v":{"$error":"#REF!"}},null,{"$f":"'RICE ACCOUNT'!F7","v":0},{"$f":"'RICE ACCOUNT'!G7","v":0}]
[3,{"$f":"#REF!","v":{"$error":"#REF!"}},{"$f":"'9-10-MDM&EGG'!C7","v":155},{"$error":"#REF!"},null,{"$f":"#REF!","v":{"$error":"#REF!"}},{"$f":"'9-10-MDM&EGG'!D7","v":0},{"$error":"#REF!"},null,{"$f":"#REF!","v":{"$error":"#REF!"}},{"$f":"'9-10-MDM&EGG'!E7","v":0},{"$error":"#REF!"},null,{"$error":"#REF!"},0,{"$error":"#REF!"},{"$f":"S7+V7","v":{"$error":"#REF!"}},{"$error":"#REF!"},{"$f":"Q8-R8","v":{"$error":"#REF!"}},{"$f":"'RICE ACCOUNT'!F8","v":0},{"$f":"'RICE ACCOUNT'!G8","v":0},0,{"$f":"J8*COSTPCHILDUPS","v":{"$error":"#REF!"}},0,{"$error":"#REF!"},null,{"$f":"'RICE ACCOUNT'!F8","v":0},{"$f":"'RICE ACCOUNT'!G8","v":0}]
[4,{"$f":"#REF!","v":{"$error":"#REF!"}},{"$f":"'9-10-MDM&EGG'!C8","v":155},{"$error":"#REF!"},null,{"$f":"#REF!","v":{"$error":"#REF!"}},{"$f":"'9-10-MDM&EGG'!D8","v":0},{"$error":"#REF!"},null,{"$f":"#REF!","v":{"$error":"#REF!"}},{"$f":"'9-10-MDM&EGG'!E8","v":0},{"$error":"#REF!"},null,{"$error":"#REF!"},0,{"$error":"#REF!"},{"$error":"#REF!"},{"$error":"#REF!"},{"$error":"#REF!"},{"$f":"'RICE ACCOUNT'!F9","v":0},{"$f":"'RICE ACCOUNT'!G9","v":0},0,{"$error":"#REF!"},0,{"$error":"#REF!"},null,{"$f":"'RICE ACCOUNT'!F9","v":0},{"$f":"'RICE ACCOUNT'!G9","v":0}]
[5,{"$f":"#REF!","v":{"$error":"#REF!"}},{"$f":"'9-10-MDM&EGG'!C9","v":155},{"$error":"#REF!"},null,{"$f":"#REF!","v":{"$error":"#REF!"}},{"$f":"'9-10-MDM&EGG'!D9","v":0},{"$error":"#REF!"},null,{"$f":"#REF!","v":{"$error":"#REF!"}},{"$f":"'9-10-MDM&EGG'!E9","v":0},{"$error":"#REF!"},null,{"$error":"#REF!"},0,{"$error":"#REF!"},{"$error":"#REF!"},{"$error":"#REF!"},{"$error":"#REF!"},{"$f":"'RICE ACCOUNT'!F10","v":0},{"$f":"'RICE ACCOUNT'!G10","v":0},0,{"$error":"#REF!"},0,{"$error":"#REF!"},null,{"$f":"'RICE ACCOUNT'!F10","v":0},{"$f":"'RICE ACCOUNT'!G10","v":0}]
[6,{"$f":"#REF!","v":{"$error":"#REF!"}},{"$f":"'9-10-MDM&EGG'!C10","v":155},{"$error":"#REF!"},null,{"$f":"#REF!","v":{"$error":"#REF!"}},{"$f":"'9-10-MDM&EGG'!D10","v":0},{"$error":"#REF!"},null,{"$f":"#REF!","v":{"$error":"#REF!"}},{"$f":"'9-10-MDM&EGG'!E10","v":0},{"$error":"#REF!"},null,{"$error":"#REF!"},0,{"$error":"#REF!"},{"$error":"#REF!"},{"$error":"#REF!"},{"$error":"#REF!"},{"$f":"'RICE ACCOUNT'!F11","v":0},{"$f":"'RICE ACCOUNT'!G11","v":0},0,{"$error":"#REF!"},0,{"$error":"#REF!"},null,{"$f":"'RICE ACCOUNT'!F11","v":0},{"$f":"'RICE ACCOUNT'!G11","v":0}]
[7,{"$f":"#REF!","v":{"$error":"#REF!"}},{"$f":"'9-10-MDM&EGG'!C11","v":155},{"$error":"#REF!"},null,{"$f":"#REF!","v":{"$error":"#REF!"}},{"$f":"'9-10-MDM&EGG'!D11","v":0},{"$error":"#REF!"},null,{"$f":"#REF!","v":{"$error":"#REF!"}},{"$f":"'9-10-MDM&EGG'!E11","v":0},{"$error":"#REF!"},null,{"$error":"#REF!"},0,{"$error":"#REF!"},{"$error":"#REF!"},{"$error":"#REF!"},{"$error":"#REF!"},{"$f":"'RICE ACCOUNT'!F12","v":0},{"$f":"'RICE ACCOUNT'!G12","v":0},0,{"$error":"#REF!"},0,{"$error":"#REF!"},null,{"$f":"'RICE ACCOUNT'!F12","v":0},{"$f":"'RICE ACCOUNT'!G12","v":0}]
[8,{"$f":"#REF!","v":{"$error":"#REF!"}},{"$f":"'9-10-MDM&EGG'!C12","v":155},{"$error":"#REF!"},null,{"$f":"#REF!","v":{"$error":"#REF!"}},{"$f":"'9-10-MDM&EGG'!D12","v":0},{"$error":"#REF!"},null,{"$f":"#REF!","v":{"$error":"#REF!"}},{"$f":"'9-10-MDM&EGG'!E12","v":0},{"$error":"#REF!"},null,{"$error":"#REF!"},0,{"$error":"#REF!"},{"$error":"#REF!"},{"$error":"#REF!"},{"$error":"#REF!"},{"$f":"'RICE ACCOUNT'!F13","v":0},{"$f":"'RICE ACCOUNT'!G13","v":0},0,{"$error":"#REF!"},0,{"$error":"#REF!"},null,{"$f":"'RICE ACCOUNT'!F13","v":0},{"$f":"'RICE ACCOUNT'!G13","v":0}]
[9,{"$f":"#REF!","v":{"$error":"#REF!"}},{"$f":"'9-10-MDM&EGG'!C13","v":155},{"$error":"#REF!"},null,{"$f":"#REF!","v":{"$error":"#REF!"}},{"$f":"'9-10-MDM&EGG'!D13","v":0},{"$error":"#REF!"},null,{"$f":"#REF!","v":{"$error":"#REF!"}},{"$f":"'9-10-MDM&EGG'!E13","v":0},{"$error":"#REF!"},null,{"$error":"#REF!"},0,{"$error":"#REF!"},{"$error":"#REF!"},{"$error":"#REF!"},{"$error":"#REF!"},{"$f":"'RICE ACCOUNT'!F14","v":0},{"$f":"'RICE ACCOUNT'!G14","v":0},0,{"$error":"#REF!"},0,{"$error":"#REF!"},null,{"$f":"'RICE ACCOUNT'!F14","v":0},{"$f":"'RICE ACCOUNT'!G14","v":0}]
[10,{"$f":"#REF!","v":{"$error":"#REF!"}},{"$f":"'9-10-MDM&EGG'!C14","v":155},{"$error":"#REF!"},null,{"$f":"#REF!","v":{"$error":"#REF!"}},{"$f":"'9-10-MDM&EGG'!D14","v":0},{"$error":"#REF!"},null,{"$f":"#REF!","v":{"$error":"#REF!"}},{"$f":"'9-10-MDM&EGG'!E14","v":0},{"$error":"#REF!"},null,{"$error":"#REF!"},0,{"$error":"#REF!"},{"$error":"#REF!"},{"$error":"#REF!"},{"$error":"#REF!"},{"$f":"'RICE ACCOUNT'!F15","v":0},{"$f":"'RICE ACCOUNT'!G15","v":0},0,{"$error":"#REF!"},0,{"$error":"#REF!"},null,{"$f":"'RICE ACCOUNT'!F15","v":0},{"$f":"'RICE ACCOUNT'!G15","v":0}]
[11,{"$f":"#REF!","v":{"$error":"#REF!"}},{"$f":"'9-10-MDM&EGG'!C15","v":155},{"$error":"#REF!"},null,{"$f":"#REF!","v":{"$error":"#REF!"}},{"$f":"'9-10-MDM&EGG'!D15","v":0},{"$error":"#REF!"},null,{"$f":"#REF!","v":{"$error":"#REF!"}},{"$f":"'9-10-MDM&EGG'!E15","v":0},{"$error":"#REF!"},null,{"$error":"#REF!"},0,{"$error":"#REF!"},{"$error":"#REF!"},{"$error":"#REF!"},{"$error":"#REF!"},{"$f":"'RICE ACCOUNT'!F16","v":0},{"$f":"'RICE ACCOUNT'!G16","v":0},0,{"$error":"#REF!"},0,{"$error":"#REF!"},null,{"$f":"'RICE ACCOUNT'!F16","v":0},{"$f":"'RICE ACCOUNT'!G16","v":0}]
[12,{"$f":"#REF!","v":{"$error":"#REF!"}},{"$f":"'9-10-MDM&EGG'!C16","v":155},{"$error":"#REF!"},null,{"$f":"#REF!","v":{"$error":"#REF!"}},{"$f":"'9-10-MDM&EGG'!D16","v":0},{"$error":"#REF!"},null,{"$f":"#REF!","v":{"$error":"#REF!"}},{"$f":"'9-10-MDM&EGG'!E16","v":0},{"$error":"#REF!"},null,{"$error":"#REF!"},0,{"$error":"#REF!"},{"$error":"#REF!"},{"$error":"#REF!"},{"$error":"#REF!"},{"$f":"'RICE ACCOUNT'!F17","v":0},{"$f":"'RICE ACCOUNT'!G17","v":0},0,{"$error":"#REF!"},0,{"$error":"#REF!"},null,{"$f":"'RICE ACCOUNT'!F17","v":0},{"$f":"'RICE ACCOUNT'!G17","v":0}]
[13,{"$f":"#REF!","v":{"$error":"#REF!"}},{"$f":"'9-10-MDM&EGG'!C17","v":155},{"$error":"#REF!"},null,{"$f":"#REF!","v":{"$error":"#REF!"}},{"$f":"'9-10-MDM&EGG'!D17","v":0},{"$error":"#REF!"},null,{"$f":"#REF!","v":{"$error":"#REF!"}},{"$f":"'9-10-MDM&EGG'!E17","v":0},{"$error":"#REF!"},null,{"$error":"#REF!"},0,{"$error":"#REF!"},{"$error":"#REF!"},{"$error":"#REF!"},{"$error":"#REF!"},{"$f":"'RICE ACCOUNT'!F18","v":0},{"$f":"'RICE ACCOUNT'!G18","v":0},0,{"$error":"#REF!"},0,{"$error":"#REF!"},null,{"$f":"'RICE ACCOUNT'!F18","v":0},{"$f":"'RICE ACCOUNT'!G18","v":0}]
[14,{"$f":"#REF!","v":{"$error":"#REF!"}},{"$f":"'9-10-MDM&EGG'!C18","v":155},{"$error":"#REF!"},null,{"$f":"#REF!","v":{"$error":"#REF!"}},{"$f":"'9-10-MDM&EGG'!D18","v":0},{"$error":"#REF!"},null,{"$f":"#REF!","v":{"$error":"#REF!"}},{"$f":"'9-10-MDM&EGG'!E18","v":0},{"$error":"#REF!"},null,{"$error":"#REF!"},0,{"$error":"#REF!"},{"$error":"#REF!"},{"$error":"#REF!"},{"$error":"#REF!"},{"$f":"'RICE ACCOUNT'!F19","v":0},{"$f":"'RICE ACCOUNT'!G19","v":0},0,{"$error":"#REF!"},0,{"$error":"#REF!"},null,{"$f":"'RICE ACCOUNT'!F19","v":0},{"$f":"'RICE ACCOUNT'!G19","v":0}]
[15,{"$f":"#REF!","v":{"$error":"#REF!"}},{"$f":"'9-10-MDM&EGG'!C19","v":155},{"$error":"#REF!"},null,{"$f":"#REF!","v":{"$error":"#REF!"}},{"$f":"'9-10-MDM&EGG'!D19","v":0},{"$error":"#REF!"},null,{"$f":"#REF!","v":{"$error":"#REF!"}},{"$f":"'9-10-MDM&EGG'!E19","v":0},{"$error":"#REF!"},null,{"$error":"#REF!"},0,{"$error":"#REF!"},{"$error":"#REF!"},{"$error":"#REF!"},{"$error":"#REF!"},{"$f":"'RICE ACCOUNT'!F20","v":0},{"$f":"'RICE ACCOUNT'!G20","v":0},0,{"$error":"#REF!"},0,{"$error":"#REF!"},null,{"$f":"'RICE ACCOUNT'!F20","v":0},{"$f":"'RICE ACCOUNT'!G20","v":0}]
[16,{"$f":"#REF!","v":{"$error":"#REF!"}},{"$f":"'9-10-MDM&EGG'!C20","v":166},{"$error":"#REF!"},null,{"$f":"#REF!","v":{"$error":"#REF!"}},{"$f":"'9-10-MDM&EGG'!D20","v":0},{"$error":"#REF!"},null,{"$f":"#REF!","v":{"$error":"#REF!"}},{"$f":"'9-10-MDM&EGG'!E20","v":0},{"$error":"#REF!"},null,{"$error":"#REF!"},0,{"$error":"#REF!"},{"$error":"#REF!"},{"$error":"#REF!"},{"$error":"#REF!"},{"$f":"'RICE ACCOUNT'!F21","v":0},{"$f":"'RICE ACCOUNT'!G21","v":0},0,{"$error":"#REF!"},0,{"$error":"#REF!"},null,{"$f":"'RICE ACCOUNT'!F21","v":0},{"$f":"'RICE ACCOUNT'!G21","v":0}]
[17,{"$f":"#REF!","v":{"$error":"#REF!"}},{"$f":"'9-10-MDM&EGG'!C21","v":213},{"$error":"#REF!"},null,{"$f":"#REF!","v":{"$error":"#REF!"}},{"$f":"'9-10-MDM&EGG'!D21","v":0},{"$error":"#REF!"},null,{"$f":"#REF!","v":{"$error":"#REF!"}},{"$f":"'9-10-MDM&EGG'!E21","v":0},{"$error":"#REF!"},null,{"$error":"#REF!"},0,{"$error":"#REF!"},{"$error":"#REF!"},{"$error":"#REF!"},{"$error":"#REF!"},{"$f":"'RICE ACCOUNT'!F22","v":0},{"$f":"'RICE ACCOUNT'!G22","v":0},0,{"$error":"#REF!"},0,{"$error":"#REF!"},null,{"$f":"'RICE ACCOUNT'!F22","v":0},{"$f":"'RICE ACCOUNT'!G22","v":0}]
[18,{"$f":"#REF!","v":{"$error":"#REF!"}},{"$f":"'9-10-MDM&EGG'!C22","v":213},{"$error":"#REF!"},null,{"$f":"#REF!","v":{"$error":"#REF!"}},{"$f":"'9-10-MDM&EGG'!D22","v":0},{"$error":"#REF!"},null,{"$f":"#REF!","v":{"$error":"#REF!"}},{"$f":"'9-10-MDM&EGG'!E22","v":0},{"$error":"#REF!"},null,{"$error":"#REF!"},0,{"$error":"#REF!"},{"$error":"#REF!"},{"$error":"#REF!"},{"$error":"#REF!"},{"$f":"'RICE ACCOUNT'!F23","v":0},{"$f":"'RICE ACCOUNT'!G23","v":0},0,{"$error":"#REF!"},0,{"$error":"#REF!"},null,{"$f":"'RICE ACCOUNT'!F23","v":0},{"$f":"'RICE ACCOUNT'!G23","v":0}]
[19,{"$f":"#REF!","v":{"$error":"#REF!"}},{"$f":"'9-10-MDM&EGG'!C23","v":213},{"$error":"#REF!"},null,{"$f":"#REF!","v":{"$error":"#REF!"}},{"$f":"'9-10-MDM&EGG'!D23","v":0},{"$error":"#REF!"},null,{"$f":"#REF!","v":{"$error":"#REF!"}},{"$f":"'9-10-MDM&EGG'!E23","v":0},{"$error":"#REF!"},null,{"$error":"#REF!"},0,{"$error":"#REF!"},{"$error":"#REF!"},{"$error":"#REF!"},{"$error":"#REF!"},{"$f":"'RICE ACCOUNT'!F24","v":0},{"$f":"'RICE ACCOUNT'!G24","v":0},0,{"$error":"#REF!"},0,{"$error":"#REF!"},null,{"$f":"'RICE ACCOUNT'!F24","v":0},{"$f":"'RICE ACCOUNT'!G24","v":0}]
[20,{"$f":"#REF!","v":{"$error":"#REF!"}},{"$f":"'9-10-MDM&EGG'!C24","v":213},{"$error":"#REF!"},null,{"$f":"#REF!","v":{"$error":"#REF!"}},{"$f":"'9-10-MDM&EGG'!D24","v":0},{"$error":"#REF!"},null,{"$f":"#REF!","v":{"$error":"#REF!"}},{"$f":"'9-10-MDM&EGG'!E24","v":0},{"$error":"#REF!"},null,{"$error":"#REF!"},0,{"$error":"#REF!"},{"$error":"#REF!"},{"$error":"#REF!"},{"$error":"#REF!"},{"$f":"'RICE ACCOUNT'!F25","v":0},{"$f":"'RICE ACCOUNT'!G25","v":0},0,{"$error":"#REF!"},0,{"$error":"#REF!"},null,{"$f":"'RICE ACCOUNT'!F25","v":0},{"$f":"'RICE ACCOUNT'!G25","v":0}]
[21,{"$f":"#REF!","v":{"$error":"#REF!"}},{"$f":"'9-10-MDM&EGG'!C25","v":213},{"$error":"#REF!"},null,{"$f":"#REF!","v":{"$error":"#REF!"}},{"$f":"'9-10-MDM&EGG'!D25","v":0},{"$f":"SUM(F26:G26)","v":{"$error":"#REF!"}},168,{"$f":"#REF!","v":{"$error":"#REF!"}},{"$f":"'9-10-MDM&EGG'!E25","v":0},{"$f":"SUM(J26:K26)","v":{"$error":"#REF!"}},null,{"$error":"#REF!"},0,{"$error":"#REF!"},{"$error":"#REF!"},{"$error":"#REF!"},{"$error":"#REF!"},{"$f":"'RICE ACCOUNT'!F26","v":0},{"$f":"'RICE ACCOUNT'!G26","v":0},0,{"$error":"#REF!"},0,{"$error":"#REF!"},null,{"$f":"'RICE ACCOUNT'!F26","v":0},{"$f":"'RICE ACCOUNT'!G26","v":0}]
[22,{"$f":"#REF!","v":{"$error":"#REF!"}},{"$f":"'9-10-MDM&EGG'!C26","v":213},{"$error":"#REF!"},null,{"$f":"#REF!","v":{"$error":"#REF!"}},{"$f":"'9-10-MDM&EGG'!D26","v":0},{"$error":"#REF!"},null,{"$f":"#REF!","v":{"$error":"#REF!"}},{"$f":"'9-10-MDM&EGG'!E26","v":0},{"$error":"#REF!"},null,{"$error":"#REF!"},0,{"$error":"#REF!"},{"$error":"#REF!"},{"$error":"#REF!"},{"$error":"#REF!"},{"$f":"'RICE ACCOUNT'!F27","v":0},{"$f":"'RICE ACCOUNT'!G27","v":0},0,{"$error":"#REF!"},0,{"$error":"#REF!"},null,{"$f":"'RICE ACCOUNT'!F27","v":0},{"$f":"'RICE ACCOUNT'!G27","v":0}]
[23,{"$f":"#REF!","v":{"$error":"#REF!"}},{"$f":"'9-10-MDM&EGG'!C27","v":152},{"$error":"#REF!"},null,{"$f":"#REF!","v":{"$error":"#REF!"}},{"$f":"'9-10-MDM&EGG'!D27","v":0},{"$error":"#REF!"},null,{"$f":"#REF!","v":{"$error":"#REF!"}},{"$f":"'9-10-MDM&EGG'!E27","v":0},{"$error":"#REF!"},null,{"$error":"#REF!"},0,{"$error":"#REF!"},{"$error":"#REF!"},{"$error":"#REF!"},{"$error":"#REF!"},{"$f":"'RICE ACCOUNT'!F28","v":0},{"$f":"'RICE ACCOUNT'!G28","v":0},0,{"$error":"#REF!"},0,{"$error":"#REF!"},null,{"$f":"'RICE ACCOUNT'!F28","v":0},{"$f":"'RICE ACCOUNT'!G28","v":0}]
[24,{"$f":"#REF!","v":{"$error":"#REF!"}},{"$f":"'9-10-MDM&EGG'!C28","v":213},{"$error":"#REF!"},null,{"$f":"#REF!","v":{"$error":"#REF!"}},{"$f":"'9-10-MDM&EGG'!D28","v":0},{"$error":"#REF!"},null,{"$f":"#REF!","v":{"$error":"#REF!"}},{"$f":"'9-10-MDM&EGG'!E28","v":0},{"$error":"#REF!"},null,{"$error":"#REF!"},0,{"$error":"#REF!"},{"$error":"#REF!"},{"$error":"#REF!"},{"$error":"#REF!"},{"$f":"'RICE ACCOUNT'!F29","v":0},{"$f":"'RICE ACCOUNT'!G29","v":0},0,{"$error":"#REF!"},0,{"$error":"#REF!"},null,{"$f":"'RICE ACCOUNT'!F29","v":0},{"$f":"'RICE ACCOUNT'!G29","v":0}]
[25,{"$f":"#REF!","v":{"$error":"#REF!"}},{"$f":"'9-10-MDM&EGG'!C29","v":213},{"$error":"#REF!"},null,{"$f":"#REF!","v":{"$error":"#REF!"}},{"$f":"'9-10-MDM&EGG'!D29","v":0},{"$error":"#REF!"},null,{"$f":"#REF!","v":{"$error":"#REF!"}},{"$f":"'9-10-MDM&EGG'!E29","v":0},{"$error":"#REF!"},null,{"$error":"#REF!"},0,{"$error":"#REF!"},{"$error":"#REF!"},{"$error":"#REF!"},{"$error":"#REF!"},{"$f":"'RICE ACCOUNT'!F30","v":0},{"$f":"'RICE ACCOUNT'!G30","v":0},0,{"$error":"#REF!"},0,{"$error":"#REF!"},null,{"$f":"'RICE ACCOUNT'!F30","v":0},{"$f":"'RICE ACCOUNT'!G30","v":0}]
[26,{"$f":"#REF!","v":{"$error":"#REF!"}},{"$f":"'9-10-MDM&EGG'!C30","v":213},{"$error":"#REF!"},null,{"$f":"#REF!","v":{"$error":"#REF!"}},{"$f":"'9-10-MDM&EGG'!D30","v":0},{"$error":"#REF!"},null,{"$f":"#REF!","v":{"$error":"#REF!"}},{"$f":"'9-10-MDM&EGG'!E30","v":0},{"$error":"#REF!"},null,{"$error":"#REF!"},0,{"$error":"#REF!"},{"$error":"#REF!"},{"$error":"#REF!"},{"$error":"#REF!"},{"$f":"'RICE ACCOUNT'!F31","v":0},{"$f":"'RICE ACCOUNT'!G31","v":0},0,{"$error":"#REF!"},0,{"$error":"#REF!"},null,{"$f":"'RICE ACCOUNT'!F31","v":0},{"$f":"'RICE ACCOUNT'!G31","v":0}]
[27,{"$f":"#REF!","v":{"$error":"#REF!"}},{"$f":"'9-10-MDM&EGG'!C31","v":213},{"$error":"#REF!"},null,{"$f":"#REF!","v":{"$error":"#REF!"}},{"$f":"'9-10-MDM&EGG'!D31","v":0},{"$error":"#REF!"},null,{"$f":"#REF!","v":{"$error":"#REF!"}},{"$f":"'9-10-MDM&EGG'!E31","v":0},{"$error":"#REF!"},null,{"$error":"#REF!"},0,{"$error":"#REF!"},{"$error":"#REF!"},{"$error":"#REF!"},{"$error":"#REF!"},{"$f":"'RICE ACCOUNT'!F32","v":0},{"$f":"'RICE ACCOUNT'!G32","v":0},0,{"$error":"#REF!"},0,{"$error":"#REF!"},null,{"$f":"'RICE ACCOUNT'!F32","v":0},{"$f":"'RICE ACCOUNT'!G32","v":0}]
[28,{"$f":"#REF!","v":{"$error":"#REF!"}},{"$f":"'9-10-MDM&EGG'!C32","v":213},{"$error":"#REF!"},null,{"$f":"#REF!","v":{"$error":"#REF!"}},{"$f":"'9-10-MDM&EGG'!D32","v":0},{"$error":"#REF!"},null,{"$f":"#REF!","v":{"$error":"#REF!"}},{"$f":"'9-10-MDM&EGG'!E32","v":0},{"$error":"#REF!"},null,{"$error":"#REF!"},0,{"$error":"#REF!"},{"$error":"#REF!"},{"$error":"#REF!"},{"$error":"#REF!"},{"$f":"'RICE ACCOUNT'!F33","v":0},{"$f":"'RICE ACCOUNT'!G33","v":0},0,{"$error":"#REF!"},0,{"$error":"#REF!"},null,{"$f":"'RICE ACCOUNT'!F33","v":0},{"$f":"'RICE ACCOUNT'!G33","v":0}]
[29,{"$f":"#REF!","v":{"$error":"#REF!"}},{"$f":"'9-10-MDM&EGG'!C33","v":213},{"$error":"#REF!"},null,{"$f":"#REF!","v":{"$error":"#REF!"}},{"$f":"'9-10-MDM&EGG'!D33","v":0},{"$error":"#REF!"},null,{"$f":"#REF!","v":{"$error":"#REF!"}},{"$f":"'9-10-MDM&EGG'!E33","v":0},{"$error":"#REF!"},null,{"$error":"#REF!"},0,{"$error":"#REF!"},{"$error":"#REF!"},{"$error":"#REF!"},{"$error":"#REF!"},{"$f":"'RICE ACCOUNT'!F34","v":0},{"$f":"'RICE ACCOUNT'!G34","v":0},0,{"$error":"#REF!"},0,{"$error":"#REF!"},null,{"$f":"'RICE ACCOUNT'!F34","v":0},{"$f":"'RICE ACCOUNT'!G34","v":0}]
[30,{"$f":"#REF!","v":{"$error":"#REF!"}},{"$f":"'9-10-MDM&EGG'!C34","v":213},{"$error":"#REF!"},null,{"$f":"#REF!","v":{"$error":"#REF!"}},{"$f":"'9-10-MDM&EGG'!D34","v":0},{"$error":"#REF!"},null,{"$f":"#REF!","v":{"$error":"#REF!"}},{"$f":"'9-10-MDM&EGG'!E34","v":0},{"$error":"#REF!"},null,{"$error":"#REF!"},0,{"$error":"#REF!"},{"$error":"#REF!"},{"$error":"#REF!"},{"$error":"#REF!"},{"$f":"'RICE ACCOUNT'!F35","v":0},{"$f":"'RICE ACCOUNT'!G35","v":0},0,{"$error":"#REF!"},0,{"$error":"#REF!"},null,{"$f":"'RICE ACCOUNT'!F35","v":0},{"$f":"'RICE ACCOUNT'!G35","v":0}]
[31,{"$f":"#REF!","v":{"$error":"#REF!"}},{"$f":"'9-10-MDM&EGG'!C35","v":213},{"$error":"#REF!"},null,{"$f":"#REF!","v":{"$error":"#REF!"}},{"$f":"'9-10-MDM&EGG'!D35","v":0},{"$error":"#REF!"},null,{"$f":"#REF!","v":{"$error":"#REF!"}},{"$f":"'9-10-MDM&EGG'!E35","v":0},{"$error":"#REF!"},null,{"$error":"#REF!"},0,{"$error":"#REF!"},{"$error":"#REF!"},{"$error":"#REF!"},{"$error":"#REF!"},{"$f":"'RICE ACCOUNT'!F36","v":0},{"$f":"'RICE ACCOUNT'!G36","v":0},0,{"$error":"#REF!"},0,{"$error":"#REF!"},null,{"$f":"'RICE ACCOUNT'!F36","v":0},{"$f":"'RICE ACCOUNT'!G36","v":0}]
[null,{"$f":"#REF!","v":{"$error":"#REF!"}},{"$f":"'9-10-MDM&EGG'!C36","v":0},{"$error":"#REF!"},null,{"$f":"SUM(F6:F36)","v":{"$error":"#REF!"}},{"$f":"SUM(G6:G36)","v":0},{"$error":"#REF!"},null,{"$f":"SUM(J6:J36)","v":{"$error":"#REF!"}},{"$f":"SUM(K6:K36)","v":0},{"$f":"SUM(L6:L36)","v":{"$error":"#REF!"}},null,{"$f":"SUM(N6:N36)","v":{"$error":"#REF!"}},{"$f":"SUM(O6:O36)","v":0},{"$f":"SUM(P6:P36)","v":{"$error":"#REF!"}},null,{"$f":"SUM(R6:R36)","v":{"$error":"#REF!"}},{"$f":"S36+V36","v":{"$error":"#REF!"}},{"$f":"SUM(T6:T36)","v":0},{"$f":"SUM(U6:U36)","v":0},{"$f":"SUM(V6:V36)","v":0},{"$f":"J37*COSTPCHILDUPS","v":{"$error":"#REF!"}},0,{"$f":"SUM(W37:X37)","v":{"$error":"#REF!"}},null,{"$f":"SUM(AA6:AA36)","v":0},{"$f":"SUM(AB6:AB36)","v":0}]
[]
["RICE ACCOUNT"]
["RICE OPENING  BALANCE",null,null,null,null,"RICE RECEIVED \nDURING THE MONTH",null,null,null,"TOTAL RICE",null,null,null,"RICE UTILIZED DURING MONTH",null,"BALANCE RICE",null,"UPS AMOUNT",null,"HS AMOUNT",null,"ROUNDED UPS AMOUNT",null,"ROUNDED HS AMOUNT","TOTAL AMOUNT",null,null,"REMARKS"]
[{"$f":"UPSBALANCE+HSBALANCE","v":230},null,null,null,null,{"$f":"V37","v":0},null,null,null,{"$f":"SUM(A41:I41)","v":230},null,null,null,{"$f":"R37","v":{"$error":"#REF!"}},null,{"$f":"J41-N41","v":{"$error":"#REF!"}},null,{"$f":"W37","v":{"$error":"#REF!"}},null,{"$f":"X37","v":0},null,{"$f":"ROUND(W37,0)","v":{"$error":"#REF!"}},null,{"$f":"ROUND(X37,0)","v":0},{"$f":"SUM(V41:X41)","v":{"$error":"#REF!"}}]
[]
[]
[]
[null,null,null,null,null,null,null,null,null,null,null,null,null,null,null,null,null,null,null,null,null,null,null,null,null,null,null,null,"ఆలుగడ్డ టమాట"]
[null,null,null,null,null,null,null,null,null,null,null,null,null,null,null,null,null,null,null,null,null,null,null,null,null,null,null,null,"గుడ్డు+సాంబారు"]
[null,null,null,null,null,null,null,null,null,null,null,null,null,null,null,null,null,null,null,null,null,null,null,null,null,null,null,null,"అరటిపండు+సాంబారు"]
[null,null,null,null,null,null,null,null,null,null,null,null,null,null,null,null,null,null,null,null,null,null,null,null,null,null,null,null,"వంకాయ+ఆలుగడ్డ"]
[null,null,null,null,null,null,null,null,null,null,null,null,null,null,null,null,null,null,null,null,null,null,null,null,null,null,null,null,"సోరకాయ పప్పు"]
[null,null,null,null,null,null,null,null,null,null,null,null,null,null,null,null,null,null,null,null,null,null,null,null,null,null,null,null,"గుడ్డు+సాంబారు"]
[null,null,null,null,null,null,null,null,null,null,null,null,null,null,null,null,null,null,null,null,null,null,null,null,null,null,null,null,"బీరకాయ టమాట"]
[null,null,null,null,null,null,null,null,null,null,null,null,null,null,null,null,null,null,null,null,null,null,null,null,null,null,null,null,"వంకాయ+ఆలుగడ్డ"]
[null,null,null,null,null,null,null,null,null,null,null,null,null,null,null,null,null,null,null,null,null,null,null,"వంకాయ పప్పు",null,null,null,null,"గుడ్డు+సాంబారు"]
[null,null,null,null,null,null,null,null,null,null,null,null,null,null,null,null,null,null,null,null,null,null,null,null,null,null,null,null,"పప్పుచారు"]
[null,null,null,null,null,null,null,null,null,null,null,null,null,null,null,null,null,null,null,null,null,null,null,null,null,null,null,null,"సోరకాయ పప్పు"]
[null,null,null,null,null,null,null,null,null,null,null,null,null,null,null,null,null,null,null,null,null,null,null,null,null,null,null,null,"గుడ్డు+సాంబారు"]
[null,null,null,null,null,null,null,null,null,null,null,null,null,null,null,null,null,null,null,null,null,null,null,null,null,null,null,null,"వంకాయ+ఆలుగడ్డ"]
[null,null,null,null,null,null,null,null,null,null,null,null,null,null,null,null,null,null,null,null,null,null,null,null,null,null,null,null,"బీరకాయ పప్పు"]
[null,null,null,null,null,null,null,null,null,null,null,null,null,null,null,null,null,null,null,null,null,null,null,null,null,null,null,null,"గుడ్డు+సాంబారు"]

{"sheet":"TOTALS-LS (2)","index":8,"n_rows":59,"n_cols":32,"rows_kept":59,"cut":false,"hidden":true,"merged":[[0,0,0,30],[1,2,1,7],[1,9,1,24],[1,25,1,27],[1,29,1,30],[39,21,39,22],[40,21,40,22],[40,30,40,31],[2,13,2,18],[39,23,39,24],[40,23,40,24],[39,19,39,20],[2,25,2,27],[39,25,39,26],[39,30,39,31],[40,17,40,18],[40,19,40,20],[40,25,40,26],[39,17,39,18],[2,19,2,21],[2,22,2,24],[2,5,2,7],[2,1,2,3],[2,0,4,0],[39,13,39,16],[40,13,40,16],[40,0,40,3],[40,5,40,7],[40,9,40,11],[39,0,39,3],[39,5,39,7],[39,9,39,11]]}
["MID-DAY MEALS PROGRAMME"]
[null,null,{"$f":"\"MANDAL : \" & MANDAL","v":"MANDAL : XYZ"},null,null,null,null,null,null,{"$f":"\"SCHOOL : \" & SCHOOL","v":"SCHOOL : ZPHS ABC"},null,null,null,null,null,null,null,null,null,null,null,null,null,null,null,null,null,null,null,{"$f":"MONTH","v":43831},null,{"$f":"MONTH","v":43831}]
["DATE","ENROLLED",null,null,null,"PRSENT",null,null,null,"MDM TAKEN",null,null,null,"RICE ISSUED",null,null,null,null,null,"RICE RECEIVED",null,null,"BALANCE RICE",null,null,"AMOUNT",null,null,null,"RICE RECEIVED",null,"MENU"]
[null,"UPS","HS","TOTAL",null,"UPS","HS","TOTAL",null,"UPS","HS","TOTAL",null,"UPS OPENING RICE  BAL.","RICE GIVEN TO UPS","UPS RICE BALANCE","HS OPENING RICE  BAL.","RICE GIVEN TO UPS","HS RICE BALANCE","UPS","HS","TOAL","UPS \nRICE BALANCE","HS RICE BALANCE","TOTAL RICE BALANCE","UPS","HS","TOTAL",null,"UPS","HS"]
[null,"LAST MONTH RICE BALANCE ------->",null,null,null,null,null,null,null,null,null,null,null,{"$f":"'PRIMARY INFORMATION'!$C$10","v":120},null,{"$f":"SUM(N5:O5)","v":120},{"$f":"'PRIMARY INFORMATION'!$C$11","v":110},null,{"$f":"SUM(Q5:R5)","v":110},null,null,null,null,null,null,{"$f":"COSTPCHILDUPS","v":6.18}]
[1,{"$f":"#REF!","v":{"$error":"#REF!"}},{"$f":"'9-10-MDM&EGG'!C5","v":155},{"$f":"SUM(B6:C6)","v":{"$error":"#REF!"}},null,{"$f":"#REF!","v":{"$error":"#REF!"}},{"$f":"'9-10-MDM&EGG'!D5","v":0},{"$f":"SUM(F6:G6)","v":{"$error":"#REF!"}},null,{"$f":"#REF!","v":{"$error":"#REF!"}},{"$f":"'9-10-MDM&EGG'!E5","v":0},{"$f":"SUM(J6:K6)","v":{"$error":"#REF!"}},null,{"$f":"P5+T6","v":{"$error":"#REF!"}},{"$f":"J6*150/1000","v":{"$error":"#REF!"}},{"$f":"N6-O6","v":{"$error":"#REF!"}},{"$f":"S5+U6","v":110},{"$f":"K6*150/1000","v":0},{"$f":"Q6-R6","v":110},{"$f":"'ENTRY SHEET'!#REF!","v":{"$error":"#REF!"}},{"$f":"'ENTRY SHEET'!K5","v":0},{"$f":"SUM(T6:U6)","v":{"$error":"#REF!"}},{"$f":"N6+T6-O6","v":{"$error":"#REF!"}},{"$f":"Q6+U6-R6","v":110},{"$f":"SUM(W6:X6)","v":{"$error":"#REF!"}},{"$f":"J6*COSTPCHILDUPS","v":{"$error":"#REF!"}},{"$f":"K6*COSTPCHILDUPS","v":0},{"$f":"SUM(Z6:AA6)","v":{"$error":"#REF!"}},null,{"$f":"'RICE ACCOUNT'!F6","v":0},{"$f":"'RICE ACCOUNT'!G6","v":0}]
[2,{"$f":"#REF!","v":{"$error":"#REF!"}},{"$f":"'9-10-MDM&EGG'!C6","v":155},{"$f":"SUM(B7:C7)","v":{"$error":"#REF!"}},null,{"$f":"#REF!","v":{"$error":"#REF!"}},{"$f":"'9-10-MDM&EGG'!D6","v":0},{"$f":"SUM(F7:G7)","v":{"$error":"#REF!"}},null,{"$f":"#REF!","v":{"$error":"#REF!"}},{"$f":"'9-10-MDM&EGG'!E6","v":0},{"$f":"SUM(J7:K7)","v":{"$error":"#REF!"}},null,{"$f":"P6+T7","v":{"$error":"#REF!"}},{"$f":"J7*150/1000","v":{"$error":"#REF!"}},{"$f":"N7-O7","v":{"$error":"#REF!"}},{"$f":"S6+U7","v":110},{"$f":"K7*150/1000","v":0},{"$f":"Q7-R7","v":110},{"$f":"'ENTRY SHEET'!#REF!","v":{"$error":"#REF!"}},{"$f":"'ENTRY SHEET'!K6","v":0},{"$f":"SUM(T7:U7)","v":{"$error":"#REF!"}},{"$f":"N7+T7-O7","v":{"$error":"#REF!"}},{"$f":"Q7+U7-R7","v":110},{"$f":"SUM(W7:X7)","v":{"$error":"#REF!"}},{"$f":"J7*COSTPCHILDUPS","v":{"$error":"#REF!"}},{"$f":"K7*COSTPCHILDUPS","v":0},{"$f":"SUM(Z7:AA7)","v":{"$error":"#REF!"}},null,{"$f":"'RICE ACCOUNT'!F7","v":0},{"$f":"'RICE ACCOUNT'!G7","v":0}]
[3,{"$f":"#REF!","v":{"$error":"#REF!"}},{"$f":"'9-10-MDM&EGG'!C7","v":155},{"$error":"#REF!"},null,{"$f":"#REF!","v":{"$error":"#REF!"}},{"$f":"'9-10-MDM&EGG'!D7","v":0},{"$error":"#REF!"},null,{"$f":"#REF!","v":{"$error":"#REF!"}},{"$f":"'9-10-MDM&EGG'!E7","v":0},{"$error":"#REF!"},null,{"$error":"#REF!"},{"$error":"#REF!"},{"$error":"#REF!"},110,0,110,{"$f":"'ENTRY SHEET'!#REF!","v":{"$error":"#REF!"}},{"$f":"'ENTRY SHEET'!K7","v":0},{"$f":"SUM(T8:U8)","v":{"$error":"#REF!"}},{"$f":"N8+T8-O8","v":{"$error":"#REF!"}},110,{"$error":"#REF!"},{"$f":"J8*COSTPCHILDUPS","v":{"$error":"#REF!"}},{"$f":"K8*COSTPCHILDUPS","v":0},{"$error":"#REF!"},null,{"$f":"'RICE ACCOUNT'!F8","v":0},{"$f":"'RICE ACCOUNT'!G8","v":0}]
[4,{"$f":"#REF!","v":{"$error":"#REF!"}},{"$f":"'9-10-MDM&EGG'!C8","v":155},{"$error":"#REF!"},null,{"$f":"#REF!","v":{"$error":"#REF!"}},{"$f":"'9-10-MDM&EGG'!D8","v":0},{"$error":"#REF!"},null,{"$f":"#REF!","v":{"$error":"#REF!"}},{"$f":"'9-10-MDM&EGG'!E8","v":0},{"$error":"#REF!"},null,{"$error":"#REF!"},{"$error":"#REF!"},{"$error":"#REF!"},110,0,110,{"$f":"'ENTRY SHEET'!#REF!","v":{"$error":"#REF!"}},{"$f":"'ENTRY SHEET'!K8","v":0},{"$error":"#REF!"},{"$error":"#REF!"},110,{"$error":"#REF!"},{"$error":"#REF!"},0,{"$error":"#REF!"},null,{"$f":"'RICE ACCOUNT'!F9","v":0},{"$f":"'RICE ACCOUNT'!G9","v":0}]
[5,{"$f":"#REF!","v":{"$error":"#REF!"}},{"$f":"'9-10-MDM&EGG'!C9","v":155},{"$error":"#REF!"},null,{"$f":"#REF!","v":{"$error":"#REF!"}},{"$f":"'9-10-MDM&EGG'!D9","v":0},{"$error":"#REF!"},null,{"$f":"#REF!","v":{"$error":"#REF!"}},{"$f":"'9-10-MDM&EGG'!E9","v":0},{"$error":"#REF!"},null,{"$error":"#REF!"},{"$error":"#REF!"},{"$error":"#REF!"},110,0,110,{"$f":"'ENTRY SHEET'!#REF!","v":{"$error":"#REF!"}},{"$f":"'ENTRY SHEET'!K9","v":0},{"$error":"#REF!"},{"$error":"#REF!"},110,{"$error":"#REF!"},{"$error":"#REF!"},0,{"$error":"#REF!"},null,{"$f":"'RICE ACCOUNT'!F10","v":0},{"$f":"'RICE ACCOUNT'!G10","v":0}]
[6,{"$f":"#REF!","v":{"$error":"#REF!"}},{"$f":"'9-10-MDM&EGG'!C10","v":155},{"$error":"#REF!"},null,{"$f":"#REF!","v":{"$error":"#REF!"}},{"$f":"'9-10-MDM&EGG'!D10","v":0},{"$error":"#REF!"},null,{"$f":"#REF!","v":{"$error":"#REF!"}},{"$f":"'9-10-MDM&EGG'!E10","v":0},{"$error":"#REF!"},null,{"$error":"#REF!"},{"$error":"#REF!"},{"$error":"#REF!"},110,0,110,{"$f":"'ENTRY SHEET'!#REF!","v":{"$error":"#REF!"}},{"$f":"'ENTRY SHEET'!K10","v":0},{"$error":"#REF!"},{"$error":"#REF!"},110,{"$error":"#REF!"},{"$error":"#REF!"},0,{"$error":"#REF!"},null,{"$f":"'RICE ACCOUNT'!F11","v":0},{"$f":"'RICE ACCOUNT'!G11","v":0}]
[7,{"$f":"#REF!","v":{"$error":"#REF!"}},214,{"$error":"#REF!"},null,{"$f":"#REF!","v":{"$error":"#REF!"}},{"$f":"'9-10-MDM&EGG'!D11","v":0},{"$error":"#REF!"},null,{"$f":"#REF!","v":{"$error":"#REF!"}},{"$f":"'9-10-MDM&EGG'!E11","v":0},{"$error":"#REF!"},null,{"$error":"#REF!"},{"$error":"#REF!"},{"$error":"#REF!"},110,0,110,{"$f":"'ENTRY SHEET'!#REF!","v":{"$error":"#REF!"}},{"$f":"'ENTRY SHEET'!K11","v":0},{"$error":"#REF!"},{"$f":"N12+T12-O12","v":{"$error":"#REF!"}},110,{"$f":"SUM(W12:X12)","v":{"$error":"#REF!"}},{"$error":"#REF!"},0,{"$error":"#REF!"},null,{"$f":"'RICE ACCOUNT'!F12","v":0},{"$f":"'RICE ACCOUNT'!G12","v":0}]
[8,{"$f":"#REF!","v":{"$error":"#REF!"}},{"$f":"'9-10-MDM&EGG'!C12","v":155},{"$error":"#REF!"},null,{"$f":"#REF!","v":{"$error":"#REF!"}},{"$f":"'9-10-MDM&EGG'!D12","v":0},{"$error":"#REF!"},null,{"$f":"#REF!","v":{"$error":"#REF!"}},{"$f":"'9-10-MDM&EGG'!E12","v":0},{"$error":"#REF!"},null,{"$error":"#REF!"},{"$error":"#REF!"},{"$error":"#REF!"},110,0,110,{"$f":"'ENTRY SHEET'!#REF!","v":{"$error":"#REF!"}},{"$f":"'ENTRY SHEET'!K12","v":0},{"$error":"#REF!"},{"$f":"N13+T13-O13","v":{"$error":"#REF!"}},110,{"$f":"SUM(W13:X13)","v":{"$error":"#REF!"}},{"$error":"#REF!"},0,{"$error":"#REF!"},null,{"$f":"'RICE ACCOUNT'!F13","v":0},{"$f":"'RICE ACCOUNT'!G13","v":0}]
[9,{"$f":"#REF!","v":{"$error":"#REF!"}},{"$f":"'9-10-MDM&EGG'!C13","v":155},{"$error":"#REF!"},null,{"$f":"#REF!","v":{"$error":"#REF!"}},{"$f":"'9-10-MDM&EGG'!D13","v":0},{"$error":"#REF!"},null,{"$f":"#REF!","v":{"$error":"#REF!"}},{"$f":"'9-10-MDM&EGG'!E13","v":0},{"$error":"#REF!"},null,{"$error":"#REF!"},{"$error":"#REF!"},{"$error":"#REF!"},110,0,110,{"$f":"'ENTRY SHEET'!#REF!","v":{"$error":"#REF!"}},{"$f":"'ENTRY SHEET'!K13","v":0},{"$error":"#REF!"},{"$error":"#REF!"},110,{"$error":"#REF!"},{"$error":"#REF!"},0,{"$error":"#REF!"},null,{"$f":"'RICE ACCOUNT'!F14","v":0},{"$f":"'RICE ACCOUNT'!G14","v":0}]
[10,{"$f":"#REF!","v":{"$error":"#REF!"}},{"$f":"'9-10-MDM&EGG'!C14","v":155},{"$error":"#REF!"},null,{"$f":"#REF!","v":{"$error":"#REF!"}},{"$f":"'9-10-MDM&EGG'!D14","v":0},{"$error":"#REF!"},null,{"$f":"#REF!","v":{"$error":"#REF!"}},{"$f":"'9-10-MDM&EGG'!E14","v":0},{"$error":"#REF!"},null,{"$error":"#REF!"},{"$error":"#REF!"},{"$error":"#REF!"},110,0,110,{"$f":"'ENTRY SHEET'!#REF!","v":{"$error":"#REF!"}},{"$f":"'ENTRY SHEET'!K14","v":0},{"$error":"#REF!"},{"$error":"#REF!"},110,{"$error":"#REF!"},{"$error":"#REF!"},0,{"$error":"#REF!"},null,{"$f":"'RICE ACCOUNT'!F15","v":0},{"$f":"'RICE ACCOUNT'!G15","v":0}]
[11,{"$f":"#REF!","v":{"$error":"#REF!"}},{"$f":"'9-10-MDM&EGG'!C15","v":155},{"$error":"#REF!"},null,{"$f":"#REF!","v":{"$error":"#REF!"}},{"$f":"'9-10-MDM&EGG'!D15","v":0},{"$error":"#REF!"},null,{"$f":"#REF!","v":{"$error":"#REF!"}},{"$f":"'9-10-MDM&EGG'!E15","v":0},{"$error":"#REF!"},null,{"$error":"#REF!"},{"$error":"#REF!"},{"$error":"#REF!"},110,0,110,{"$f":"'ENTRY SHEET'!#REF!","v":{"$error":"#REF!"}},{"$f":"'ENTRY SHEET'!K15","v":0},{"$error":"#REF!"},{"$error":"#REF!"},110,{"$error":"#REF!"},{"$error":"#REF!"},0,{"$error":"#REF!"},null,{"$f":"'RICE ACCOUNT'!F16","v":0},{"$f":"'RICE ACCOUNT'!G16","v":0}]
[12,{"$f":"#REF!","v":{"$error":"#REF!"}},214,{"$error":"#REF!"},null,{"$f":"#REF!","v":{"$error":"#REF!"}},{"$f":"'9-10-MDM&EGG'!D16","v":0},{"$error":"#REF!"},null,{"$f":"#REF!","v":{"$error":"#REF!"}},{"$f":"'9-10-MDM&EGG'!E16","v":0},{"$error":"#REF!"},null,{"$error":"#REF!"},{"$error":"#REF!"},{"$error":"#REF!"},110,0,110,{"$f":"'ENTRY SHEET'!#REF!","v":{"$error":"#REF!"}},{"$f":"'ENTRY SHEET'!K16","v":0},{"$error":"#REF!"},{"$error":"#REF!"},110,{"$error":"#REF!"},{"$error":"#REF!"},0,{"$error":"#REF!"},null,{"$f":"'RICE ACCOUNT'!F17","v":0},{"$f":"'RICE ACCOUNT'!G17","v":0}]
[13,{"$f":"#REF!","v":{"$error":"#REF!"}},{"$f":"'9-10-MDM&EGG'!C17","v":155},{"$error":"#REF!"},null,{"$f":"#REF!","v":{"$error":"#REF!"}},{"$f":"'9-10-MDM&EGG'!D17","v":0},{"$error":"#REF!"},null,{"$f":"#REF!","v":{"$error":"#REF!"}},{"$f":"'9-10-MDM&EGG'!E17","v":0},{"$error":"#REF!"},null,{"$error":"#REF!"},{"$error":"#REF!"},{"$error":"#REF!"},110,0,110,{"$f":"'ENTRY SHEET'!#REF!","v":{"$error":"#REF!"}},{"$f":"'ENTRY SHEET'!K17","v":0},{"$error":"#REF!"},{"$error":"#REF!"},110,{"$error":"#REF!"},{"$error":"#REF!"},0,{"$error":"#REF!"},null,{"$f":"'RICE ACCOUNT'!F18","v":0},{"$f":"'RICE ACCOUNT'!G18","v":0}]
[14,{"$f":"#REF!","v":{"$error":"#REF!"}},{"$f":"'9-10-MDM&EGG'!C18","v":155},{"$error":"#REF!"},null,{"$f":"#REF!","v":{"$error":"#REF!"}},{"$f":"'9-10-MDM&EGG'!D18","v":0},{"$error":"#REF!"},null,{"$f":"#REF!","v":{"$error":"#REF!"}},{"$f":"'9-10-MDM&EGG'!E18","v":0},{"$error":"#REF!"},null,{"$error":"#REF!"},{"$error":"#REF!"},{"$error":"#REF!"},110,0,110,{"$f":"'ENTRY SHEET'!#REF!","v":{"$error":"#REF!"}},{"$f":"'ENTRY SHEET'!K18","v":0},{"$error":"#REF!"},{"$error":"#REF!"},110,{"$error":"#REF!"},{"$error":"#REF!"},0,{"$error":"#REF!"},null,{"$f":"'RICE ACCOUNT'!F19","v":0},{"$f":"'RICE ACCOUNT'!G19","v":0}]
[15,{"$f":"#REF!","v":{"$error":"#REF!"}},214,{"$error":"#REF!"},null,{"$f":"#REF!","v":{"$error":"#REF!"}},{"$f":"'9-10-MDM&EGG'!D19","v":0},{"$error":"#REF!"},null,{"$f":"#REF!","v":{"$error":"#REF!"}},{"$f":"'9-10-MDM&EGG'!E19","v":0},{"$error":"#REF!"},null,{"$error":"#REF!"},{"$error":"#REF!"},{"$error":"#REF!"},110,0,110,{"$f":"'ENTRY SHEET'!#REF!","v":{"$error":"#REF!"}},{"$f":"'ENTRY SHEET'!K19","v":0},{"$error":"#REF!"},{"$error":"#REF!"},110,{"$error":"#REF!"},{"$error":"#REF!"},0,{"$error":"#REF!"},null,{"$f":"'RICE ACCOUNT'!F20","v":0},{"$f":"'RICE ACCOUNT'!G20","v":0}]
[16,{"$f":"#REF!","v":{"$error":"#REF!"}},214,{"$error":"#REF!"},null,{"$f":"#REF!","v":{"$error":"#REF!"}},{"$f":"'9-10-MDM&EGG'!D20","v":0},{"$error":"#REF!"},null,{"$f":"#REF!","v":{"$error":"#REF!"}},{"$f":"'9-10-MDM&EGG'!E20","v":0},{"$error":"#REF!"},null,{"$error":"#REF!"},{"$error":"#REF!"},{"$error":"#REF!"},110,0,110,{"$f":"'ENTRY SHEET'!#REF!","v":{"$error":"#REF!"}},{"$f":"'ENTRY SHEET'!K20","v":0},{"$error":"#REF!"},{"$error":"#REF!"},110,{"$error":"#REF!"},{"$error":"#REF!"},0,{"$error":"#REF!"},null,{"$f":"'RICE ACCOUNT'!F21","v":0},{"$f":"'RICE ACCOUNT'!G21","v":0}]
[17,{"$f":"#REF!","v":{"$error":"#REF!"}},214,{"$error":"#REF!"},null,{"$f":"#REF!","v":{"$error":"#REF!"}},{"$f":"'9-10-MDM&EGG'!D21","v":0},{"$error":"#REF!"},null,{"$f":"#REF!","v":{"$error":"#REF!"}},{"$f":"'9-10-MDM&EGG'!E21","v":0},{"$error":"#REF!"},null,{"$error":"#REF!"},{"$error":"#REF!"},{"$error":"#REF!"},110,0,110,{"$f":"'ENTRY SHEET'!#REF!","v":{"$error":"#REF!"}},{"$f":"'ENTRY SHEET'!K21","v":0},{"$error":"#REF!"},{"$error":"#REF!"},110,{"$error":"#REF!"},{"$error":"#REF!"},0,{"$error":"#REF!"},null,{"$f":"'RICE ACCOUNT'!F22","v":0},{"$f":"'RICE ACCOUNT'!G22","v":0}]
[18,{"$f":"#REF!","v":{"$error":"#REF!"}},214,{"$error":"#REF!"},null,{"$f":"#REF!","v":{"$error":"#REF!"}},{"$f":"'9-10-MDM&EGG'!D22","v":0},{"$error":"#REF!"},null,{"$f":"#REF!","v":{"$error":"#REF!"}},{"$f":"'9-10-MDM&EGG'!E22","v":0},{"$error":"#REF!"},null,{"$error":"#REF!"},{"$error":"#REF!"},{"$error":"#REF!"},110,0,110,{"$f":"'ENTRY SHEET'!#REF!","v":{"$error":"#REF!"}},{"$f":"'ENTRY SHEET'!K22","v":0},{"$error":"#REF!"},{"$error":"#REF!"},110,{"$error":"#REF!"},{"$error":"#REF!"},0,{"$error":"#REF!"},null,{"$f":"'RICE ACCOUNT'!F23","v":0},{"$f":"'RICE ACCOUNT'!G23","v":0}]
[19,{"$f":"#REF!","v":{"$error":"#REF!"}},{"$f":"'9-10-MDM&EGG'!C23","v":213},{"$error":"#REF!"},null,{"$f":"#REF!","v":{"$error":"#REF!"}},{"$f":"'9-10-MDM&EGG'!D23","v":0},{"$error":"#REF!"},null,{"$f":"#REF!","v":{"$error":"#REF!"}},{"$f":"'9-10-MDM&EGG'!E23","v":0},{"$error":"#REF!"},null,{"$error":"#REF!"},{"$error":"#REF!"},{"$error":"#REF!"},110,0,110,{"$f":"'ENTRY SHEET'!#REF!","v":{"$error":"#REF!"}},{"$f":"'ENTRY SHEET'!K23","v":0},{"$error":"#REF!"},{"$error":"#REF!"},110,{"$error":"#REF!"},{"$error":"#REF!"},0,{"$error":"#REF!"},null,{"$f":"'RICE ACCOUNT'!F24","v":0},{"$f":"'RICE ACCOUNT'!G24","v":0}]
[20,{"$f":"#REF!","v":{"$error":"#REF!"}},214,{"$error":"#REF!"},null,{"$f":"#REF!","v":{"$error":"#REF!"}},{"$f":"'9-10-MDM&EGG'!D24","v":0},{"$error":"#REF!"},null,{"$f":"#REF!","v":{"$error":"#REF!"}},{"$f":"'9-10-MDM&EGG'!E24","v":0},{"$error":"#REF!"},null,{"$error":"#REF!"},{"$error":"#REF!"},{"$error":"#REF!"},110,0,110,{"$f":"'ENTRY SHEET'!#REF!","v":{"$error":"#REF!"}},{"$f":"'ENTRY SHEET'!K24","v":0},{"$error":"#REF!"},{"$error":"#REF!"},110,{"$error":"#REF!"},{"$error":"#REF!"},0,{"$error":"#REF!"},null,{"$f":"'RICE ACCOUNT'!F25","v":0},{"$f":"'RICE ACCOUNT'!G25","v":0}]
[21,{"$f":"#REF!","v":{"$error":"#REF!"}},214,{"$error":"#REF!"},null,{"$f":"#REF!","v":{"$error":"#REF!"}},{"$f":"'9-10-MDM&EGG'!D25","v":0},{"$error":"#REF!"},168,{"$f":"#REF!","v":{"$error":"#REF!"}},{"$f":"'9-10-MDM&EGG'!E25","v":0},{"$error":"#REF!"},null,{"$error":"#REF!"},{"$error":"#REF!"},{"$error":"#REF!"},110,0,110,{"$f":"'ENTRY SHEET'!#REF!","v":{"$error":"#REF!"}},{"$f":"'ENTRY SHEET'!K25","v":0},{"$error":"#REF!"},{"$error":"#REF!"},110,{"$error":"#REF!"},{"$error":"#REF!"},0,{"$error":"#REF!"},null,{"$f":"'RICE ACCOUNT'!F26","v":0},{"$f":"'RICE ACCOUNT'!G26","v":0}]
[22,{"$f":"#REF!","v":{"$error":"#REF!"}},214,{"$error":"#REF!"},null,{"$f":"#REF!","v":{"$error":"#REF!"}},{"$f":"'9-10-MDM&EGG'!D26","v":0},{"$error":"#REF!"},null,{"$f":"#REF!","v":{"$error":"#REF!"}},{"$f":"'9-10-MDM&EGG'!E26","v":0},{"$error":"#REF!"},null,{"$error":"#REF!"},{"$error":"#REF!"},{"$error":"#REF!"},110,0,110,{"$f":"'ENTRY SHEET'!#REF!","v":{"$error":"#REF!"}},{"$f":"'ENTRY SHEET'!K26","v":0},{"$error":"#REF!"},{"$error":"#REF!"},110,{"$error":"#REF!"},{"$error":"#REF!"},0,{"$error":"#REF!"},null,{"$f":"'RICE ACCOUNT'!F27","v":0},{"$f":"'RICE ACCOUNT'!G27","v":0}]
[23,{"$f":"#REF!","v":{"$error":"#REF!"}},214,{"$error":"#REF!"},null,{"$f":"#REF!","v":{"$error":"#REF!"}},{"$f":"'9-10-MDM&EGG'!D27","v":0},{"$error":"#REF!"},null,{"$f":"#REF!","v":{"$error":"#REF!"}},{"$f":"'9-10-MDM&EGG'!E27","v":0},{"$error":"#REF!"},null,{"$error":"#REF!"},{"$error":"#REF!"},{"$error":"#REF!"},110,0,110,{"$f":"'ENTRY SHEET'!#REF!","v":{"$error":"#REF!"}},{"$f":"'ENTRY SHEET'!K27","v":0},{"$error":"#REF!"},{"$error":"#REF!"},110,{"$error":"#REF!"},{"$error":"#REF!"},0,{"$error":"#REF!"},null,{"$f":"'RICE ACCOUNT'!F28","v":0},{"$f":"'RICE ACCOUNT'!G28","v":0}]
[24,{"$f":"#REF!","v":{"$error":"#REF!"}},{"$f":"'9-10-MDM&EGG'!C28","v":213},{"$error":"#REF!"},null,{"$f":"#REF!","v":{"$error":"#REF!"}},{"$f":"'9-10-MDM&EGG'!D28","v":0},{"$error":"#REF!"},null,{"$f":"#REF!","v":{"$error":"#REF!"}},{"$f":"'9-10-MDM&EGG'!E28","v":0},{"$error":"#REF!"},null,{"$error":"#REF!"},{"$error":"#REF!"},{"$error":"#REF!"},110,0,110,{"$f":"'ENTRY SHEET'!#REF!","v":{"$error":"#REF!"}},{"$f":"'ENTRY SHEET'!K28","v":0},{"$error":"#REF!"},{"$error":"#REF!"},110,{"$error":"#REF!"},{"$error":"#REF!"},0,{"$error":"#REF!"},null,{"$f":"'RICE ACCOUNT'!F29","v":0},{"$f":"'RICE ACCOUNT'!G29","v":0}]
[25,{"$f":"#REF!","v":{"$error":"#REF!"}},{"$f":"'9-10-MDM&EGG'!C29","v":213},{"$error":"#REF!"},null,{"$f":"#REF!","v":{"$error":"#REF!"}},{"$f":"'9-10-MDM&EGG'!D29","v":0},{"$error":"#REF!"},null,{"$f":"#REF!","v":{"$error":"#REF!"}},{"$f":"'9-10-MDM&EGG'!E29","v":0},{"$error":"#REF!"},null,{"$error":"#REF!"},{"$error":"#REF!"},{"$error":"#REF!"},110,0,110,{"$f":"'ENTRY SHEET'!#REF!","v":{"$error":"#REF!"}},{"$f":"'ENTRY SHEET'!K29","v":0},{"$error":"#REF!"},{"$error":"#REF!"},110,{"$error":"#REF!"},{"$error":"#REF!"},0,{"$error":"#REF!"},null,{"$f":"'RICE ACCOUNT'!F30","v":0},{"$f":"'RICE ACCOUNT'!G30","v":0}]
[26,{"$f":"#REF!","v":{"$error":"#REF!"}},{"$f":"'9-10-MDM&EGG'!C30","v":213},{"$error":"#REF!"},null,{"$f":"#REF!","v":{"$error":"#REF!"}},{"$f":"'9-10-MDM&EGG'!D30","v":0},{"$error":"#REF!"},null,{"$f":"#REF!","v":{"$error":"#REF!"}},{"$f":"'9-10-MDM&EGG'!E30","v":0},{"$error":"#REF!"},null,{"$error":"#REF!"},{"$error":"#REF!"},{"$error":"#REF!"},110,0,110,{"$f":"'ENTRY SHEET'!#REF!","v":{"$error":"#REF!"}},{"$f":"'ENTRY SHEET'!K30","v":0},{"$error":"#REF!"},{"$error":"#REF!"},110,{"$error":"#REF!"},{"$error":"#REF!"},0,{"$error":"#REF!"},null,{"$f":"'RICE ACCOUNT'!F31","v":0},{"$f":"'RICE ACCOUNT'!G31","v":0}]
[27,{"$f":"#REF!","v":{"$error":"#REF!"}},{"$f":"'9-10-MDM&EGG'!C31","v":213},{"$error":"#REF!"},null,{"$f":"#REF!","v":{"$error":"#REF!"}},{"$f":"'9-10-MDM&EGG'!D31","v":0},{"$error":"#REF!"},null,{"$f":"#REF!","v":{"$error":"#REF!"}},{"$f":"'9-10-MDM&EGG'!E31","v":0},{"$error":"#REF!"},null,{"$error":"#REF!"},{"$error":"#REF!"},{"$error":"#REF!"},110,0,110,{"$f":"'ENTRY SHEET'!#REF!","v":{"$error":"#REF!"}},{"$f":"'ENTRY SHEET'!K31","v":0},{"$error":"#REF!"},{"$error":"#REF!"},110,{"$error":"#REF!"},{"$error":"#REF!"},0,{"$error":"#REF!"},null,{"$f":"'RICE ACCOUNT'!F32","v":0},{"$f":"'RICE ACCOUNT'!G32","v":0}]
[28,{"$f":"#REF!","v":{"$error":"#REF!"}},{"$f":"'9-10-MDM&EGG'!C32","v":213},{"$error":"#REF!"},null,{"$f":"#REF!","v":{"$error":"#REF!"}},{"$f":"'9-10-MDM&EGG'!D32","v":0},{"$error":"#REF!"},null,{"$f":"#REF!","v":{"$error":"#REF!"}},{"$f":"'9-10-MDM&EGG'!E32","v":0},{"$error":"#REF!"},null,{"$error":"#REF!"},{"$error":"#REF!"},{"$error":"#REF!"},110,0,110,{"$f":"'ENTRY SHEET'!#REF!","v":{"$error":"#REF!"}},{"$f":"'ENTRY SHEET'!K32","v":0},{"$error":"#REF!"},{"$error":"#REF!"},110,{"$error":"#REF!"},{"$error":"#REF!"},0,{"$error":"#REF!"},null,{"$f":"'RICE ACCOUNT'!F33","v":0},{"$f":"'RICE ACCOUNT'!G33","v":0}]
[29,{"$f":"#REF!","v":{"$error":"#REF!"}},{"$f":"'9-10-MDM&EGG'!C33","v":213},{"$error":"#REF!"},null,{"$f":"#REF!","v":{"$error":"#REF!"}},{"$f":"'9-10-MDM&EGG'!D33","v":0},{"$error":"#REF!"},null,{"$f":"#REF!","v":{"$error":"#REF!"}},{"$f":"'9-10-MDM&EGG'!E33","v":0},{"$error":"#REF!"},null,{"$error":"#REF!"},{"$error":"#REF!"},{"$error":"#REF!"},110,0,110,{"$f":"'ENTRY SHEET'!#REF!","v":{"$error":"#REF!"}},{"$f":"'ENTRY SHEET'!K33","v":0},{"$error":"#REF!"},{"$error":"#REF!"},110,{"$error":"#REF!"},{"$error":"#REF!"},0,{"$error":"#REF!"},null,{"$f":"'RICE ACCOUNT'!F34","v":0},{"$f":"'RICE ACCOUNT'!G34","v":0}]
[30,{"$f":"#REF!","v":{"$error":"#REF!"}},{"$f":"'9-10-MDM&EGG'!C34","v":213},{"$error":"#REF!"},null,{"$f":"#REF!","v":{"$error":"#REF!"}},{"$f":"'9-10-MDM&EGG'!D34","v":0},{"$error":"#REF!"},null,{"$f":"#REF!","v":{"$error":"#REF!"}},{"$f":"'9-10-MDM&EGG'!E34","v":0},{"$error":"#REF!"},null,{"$error":"#REF!"},{"$error":"#REF!"},{"$error":"#REF!"},110,0,110,{"$f":"'ENTRY SHEET'!#REF!","v":{"$error":"#REF!"}},{"$f":"'ENTRY SHEET'!K34","v":0},{"$error":"#REF!"},{"$error":"#REF!"},110,{"$error":"#REF!"},{"$error":"#REF!"},0,{"$error":"#REF!"},null,{"$f":"'RICE ACCOUNT'!F35","v":0},{"$f":"'RICE ACCOUNT'!G35","v":0}]
[31,{"$f":"#REF!","v":{"$error":"#REF!"}},{"$f":"'9-10-MDM&EGG'!C35","v":213},{"$error":"#REF!"},null,{"$f":"#REF!","v":{"$error":"#REF!"}},{"$f":"'9-10-MDM&EGG'!D35","v":0},{"$error":"#REF!"},null,{"$f":"#REF!","v":{"$error":"#REF!"}},{"$f":"'9-10-MDM&EGG'!E35","v":0},{"$error":"#REF!"},null,{"$error":"#REF!"},{"$error":"#REF!"},{"$error":"#REF!"},110,0,110,{"$f":"'ENTRY SHEET'!#REF!","v":{"$error":"#REF!"}},{"$f":"'ENTRY SHEET'!K35","v":0},{"$error":"#REF!"},{"$error":"#REF!"},110,{"$error":"#REF!"},{"$error":"#REF!"},0,{"$error":"#REF!"},null,{"$f":"'RICE ACCOUNT'!F36","v":0},{"$f":"'RICE ACCOUNT'!G36","v":0}]
[null,{"$f":"#REF!","v":{"$error":"#REF!"}},{"$f":"'9-10-MDM&EGG'!C36","v":0},{"$error":"#REF!"},null,{"$f":"SUM(F6:F36)","v":{"$error":"#REF!"}},{"$f":"SUM(G6:G36)","v":0},{"$error":"#REF!"},null,{"$f":"SUM(J6:J36)","v":{"$error":"#REF!"}},{"$f":"SUM(K6:K36)","v":0},{"$f":"SUM(L6:L36)","v":{"$error":"#REF!"}},null,null,{"$f":"SUM(O6:O36)","v":{"$error":"#REF!"}},{"$f":"P36+S36","v":{"$error":"#REF!"}},{"$f":"SUM(Q6:Q36)","v":3410},{"$f":"SUM(R6:R36)","v":0},null,{"$f":"SUM(T6:T36)","v":{"$error":"#REF!"}},{"$f":"SUM(U6:U36)","v":0},{"$f":"SUM(V6:V36)","v":{"$error":"#REF!"}},{"$f":"W36","v":{"$error":"#REF!"}},{"$f":"X36","v":110},{"$f":"Y36","v":{"$error":"#REF!"}},{"$f":"J37*COSTPCHILDUPS","v":{"$error":"#REF!"}},0,{"$f":"SUM(Z37:AA37)","v":{"$error":"#REF!"}},null,{"$f":"SUM(AD6:AD36)","v":0},{"$f":"SUM(AE6:AE36)","v":0}]
[]
["RICE ACCOUNT"]
["RICE OPENING  BALANCE",null,null,null,null,"RICE RECEIVED \nDURING THE MONTH",null,null,null,"TOTAL RICE",null,null,null,"RICE UTILIZED DURING MONTH",null,null,null,"BALANCE RICE",null,"UPS AMOUNT",null,"HS AMOUNT",null,"UPS ROUNDED AMOUNT",null,"HS ROUNDED AMOUNT",null,"TOTAL AMOUNT",null,null,"REMARKS"]
[{"$f":"UPSBALANCE+HSBALANCE","v":230},null,null,null,null,{"$f":"V37","v":{"$error":"#REF!"}},null,null,null,{"$f":"SUM(A41:I41)","v":{"$error":"#REF!"}},null,null,null,{"$f":"O37+R37","v":{"$error":"#REF!"}},null,null,null,{"$f":"J41-N41","v":{"$error":"#REF!"}},null,{"$f":"Z37","v":{"$error":"#REF!"}},null,{"$f":"AA37","v":0},null,{"$f":"ROUND(T41,0)","v":{"$error":"#REF!"}},null,{"$f":"ROUND(V41,0)","v":0},null,{"$f":"SUM(X41:AA41)","v":{"$error":"#REF!"}}]
[]
[]
[]
[null,null,null,null,null,null,null,null,null,null,null,null,null,null,null,null,null,null,null,null,null,null,null,null,null,null,null,null,null,null,null,"ఆలుగడ్డ టమాట"]
[null,null,null,null,null,null,null,null,null,null,null,null,null,null,null,null,null,null,null,null,null,null,null,null,null,null,null,null,null,null,null,"గుడ్డు+సాంబారు"]
[null,null,null,null,null,null,null,null,null,null,null,null,null,null,null,null,null,null,null,null,null,null,null,null,null,null,null,null,null,null,null,"అరటిపండు+సాంబారు"]
[null,null,null,null,null,null,null,null,null,null,null,null,null,null,null,null,null,null,null,null,null,null,null,null,null,null,null,null,null,null,null,"వంకాయ+ఆలుగడ్డ"]
[null,null,null,null,null,null,null,null,null,null,null,null,null,null,null,null,null,null,null,null,null,null,null,null,null,null,null,null,null,null,null,"సోరకాయ పప్పు"]
[null,null,null,null,null,null,null,null,null,null,null,null,null,null,null,null,null,null,null,null,null,null,null,null,null,null,null,null,null,null,null,"గుడ్డు+సాంబారు"]
[null,null,null,null,null,null,null,null,null,null,null,null,null,null,null,null,null,null,null,null,null,null,null,null,null,null,null,null,null,null,null,"బీరకాయ టమాట"]
[null,null,null,null,null,null,null,null,null,null,null,null,null,null,null,null,null,null,null,null,null,null,null,null,null,null,null,null,null,null,null,"వంకాయ+ఆలుగడ్డ"]
[null,null,null,null,null,null,null,null,null,null,null,null,null,null,null,null,null,null,null,null,null,null,null,null,null,null,"వంకాయ పప్పు",null,null,null,null,"గుడ్డు+సాంబారు"]
[null,null,null,null,null,null,null,null,null,null,null,null,null,null,null,null,null,null,null,null,null,null,null,null,null,null,null,null,null,null,null,"పప్పుచారు"]
[null,null,null,null,null,null,null,null,null,null,null,null,null,null,null,null,null,null,null,null,null,null,null,null,null,null,null,null,null,null,null,"సోరకాయ పప్పు"]
[null,null,null,null,null,null,null,null,null,null,null,null,null,null,null,null,null,null,null,null,null,null,null,null,null,null,null,null,null,null,null,"గుడ్డు+సాంబారు"]
[null,null,null,null,null,null,null,null,null,null,null,null,null,null,null,null,null,null,null,null,null,null,null,null,null,null,null,null,null,null,null,"వంకాయ+ఆలుగడ్డ"]
[null,null,null,null,null,null,null,null,null,null,null,null,null,null,null,null,null,null,null,null,null,null,null,null,null,null,null,null,null,null,null,"బీరకాయ పప్పు"]
[null,null,null,null,null,null,null,null,null,null,null,null,null,null,null,null,null,null,null,null,null,null,null,null,null,null,null,null,null,null,null,"గుడ్డు+సాంబారు"]

{"sheet":"MONTHLY","index":9,"n_rows":50,"n_cols":10,"rows_kept":50,"cut":false,"hidden":true,"merged":[[49,0,49,3],[49,4,49,8],[42,0,42,3],[42,4,42,8],[43,0,43,3],[43,4,43,8],[44,0,44,3],[44,4,44,8],[45,0,45,3],[45,4,45,8],[46,0,46,3],[46,4,46,8],[48,0,48,8],[41,0,41,8],[30,0,30,9],[31,0,31,4],[31,5,31,9],[36,0,36,8],[37,0,37,1],[37,2,37,3],[37,4,37,5],[37,6,37,8],[38,0,38,1],[38,2,38,3],[38,4,38,5],[38,6,38,8],[40,0,40,8],[28,5,28,6],[28,8,28,9],[21,0,21,1],[21,3,21,4],[21,5,21,6],[21,7,21,9],[25,0,25,9],[26,0,26,3],[26,4,26,9],[27,5,27,6],[27,8,27,9],[22,0,22,1],[22,3,22,4],[22,5,22,6],[22,7,22,9],[20,0,20,1],[20,3,20,4],[20,5,20,6],[20,7,20,9],[15,0,15,2],[15,3,15,5],[15,6,15,9],[16,0,16,2],[16,3,16,5],[16,6,16,9],[18,0,18,9],[19,0,19,1],[19,3,19,4],[19,5,19,6],[19,7,19,9],[14,0,14,2],[14,3,14,5],[14,6,14,9],[8,1,8,2],[8,3,8,4],[8,5,8,9],[9,1,9,2],[9,3,9,4],[9,5,9,9],[10,5,10,9],[12,0,12,9],[13,0,13,2],[13,3,13,5],[13,6,13,9],[7,1,7,2],[7,3,7,4],[7,5,7,9],[0,0,0,4],[5,0,5,9],[6,1,6,2],[6,3,6,4],[6,5,6,9],[0,5,0,7]]}
["School Monthly Data for ",null,null,null,null,{"$f":"#REF!","v":{"$error":"#REF!"}}]
["Instructions:"]
["1.Keep Enrollment Register at the time of entry"]
["2.Keep Account Register at the time of entry"]
[]
["School Details"]
["School Code",1508611,null,"School Name",null,"ZPHS GUNDLA POCHAMPALLY"]
["School Type","ZP(LOCAL BODIES)",null,"Category",null,"HIGH SCHOOL"]
["State","ANDHRA PRADESH",null,"District",null,"RANGA REDDY"]
["Area","LAXMINAGAR",null,"Block",null,"MEDCHAL"]
["Village/Ward","GUNDLAPOCHAMPALLY"]
[]
["Meals Availed Status*"]
[null,null,null,"Primary",null,null,"Upper Primary"]
["Number of School Days During Month",null,null," ",null,null,15]
["Actual Number of Days Mid Day Meal Served",null,null,null,null,null,{"$f":"#REF!","v":{"$error":"#REF!"}}]
["Total Meals Served During the Month",null,null,null,null,null,{"$f":"#REF!","v":{"$error":"#REF!"}}]
[]
["Cook Cum Helper Details"]
["Name",null,"Gender","Category",null,"Mode Of Payment",null,"Amount Received during the month(In Rs)"]
["S.PRASANNA KUMARI",null,"FEMALE","OBC",null,"BANK",null,1000]
["C.NARSIMHA",null,"MALE","OBC",null,"BANK",null,1000]
[]
[]
[]
["Cooking Cost(In Rs.)"]
["Primary",null,null,null,"Upper Primary"]
["Opening Balance","Received during the Month","Expenditure during the Month","Closing Balance","Opening Balance","Received during the Month",null,"Expenditure during the Month","Closing Balance"]
["--","--","--","--",0,{"$f":"#REF!","v":{"$error":"#REF!"}},null,{"$f":"#REF!","v":{"$error":"#REF!"}},0]
[]
["Details of Foodgrain (In Quintals)"]
["Primary",null,null,null,null,"Upper Primary"]
["Food Item","Opening\nBalance","Received during the Month","Consumption during the Month","Closing\nBalance","Food Item","Opening\nBalance","Received during the Month","Consumption during the Month","Closing\nBalance"]
["Wheat","--","--","--","--","Wheat","--","--","--","--"]
["Rice","--","--","--","--","Rice",{"$f":"#REF!","v":{"$error":"#REF!"}},{"$f":"#REF!","v":{"$error":"#REF!"}},{"$f":"#REF! &\"+\"  &#REF! & \"=\" &#REF!","v":{"$error":"#REF!"}},{"$f":"#REF!","v":{"$error":"#REF!"}}]
[null,null,null,null,null,null,"REMARKS:"]
["School Expenses (In Rs.)"]
[null,null,"Total Expenditure",null,"Date of Expenditure",null,"Cumulative Expenditure at School"]
["1. MME Expenses"]
[]
["School Inspection"]
["School Inspection\t(Yes) \\ (No)"]
["Name",null,null,null,"In Number"]
["By Member of Task Force",null,null,null,0]
["By District Officials",null,null,null,0]
["By Block/Taluka Level Official",null,null,null,1]
["By SMC Members",null,null,null,2]
[]
["Untoward Incidents (If Any)"]
["Number of Incident Occured ",null,null,null,0]

{"sheet":"PRINTS==>","index":10,"n_rows":0,"n_cols":0,"rows_kept":0,"cut":false,"hidden":true,"merged":[]}

{"sheet":"RICE ACCOUNT-BKP","index":11,"n_rows":36,"n_cols":16,"rows_kept":36,"cut":false,"hidden":true,"merged":[[2,10,2,12],[2,13,2,15],[2,0,3,0],[2,1,2,3],[2,4,35,4],[2,5,2,7],[2,8,35,8],[2,9,35,9],[0,0,0,17],[1,1,1,3],[1,5,1,6],[1,7,1,10],[1,11,1,12],[1,13,1,15]]}
["MID-DAY MEALS PROGRAMME - RICE ACCOUNT"]
["MANDAL",{"$f":"MANDAL","v":"XYZ"},null,null,null,"SCHOOL",null,{"$f":"SCHOOL","v":"ZPHS ABC"},null,null,null,"MONTH",null,{"$f":"MONTH","v":43831}]
["DATE","OPENING BALANCE",null,null,null,"RICE RECEIVED",null,null,null,null,"RICE UTILIZED",null,null,"GROUND BALANCE"]
[null,"UPS","HS","TOTAL",null,"UPS","HS","TOTAL",null,null,"UPS","HS","TOTAL","UPS","HS","TOTAL"]
[1,{"$f":"'PRIMARY INFORMATION'!$C$10","v":120},{"$f":"'PRIMARY INFORMATION'!$C$11","v":110},{"$f":"SUM(B5:C5)","v":230},null,null,null,{"$f":"SUM(F5:G5)","v":0},null,null,{"$f":"#REF!","v":{"$error":"#REF!"}},{"$f":"'9-10-MDM&EGG'!#REF!","v":{"$error":"#REF!"}},{"$f":"SUM(K5:L5)","v":{"$error":"#REF!"}},{"$f":"B5+F5-K5","v":{"$error":"#REF!"}},{"$f":"C5+G5-L5","v":{"$error":"#REF!"}},{"$f":"SUM(N5:O5)","v":{"$error":"#REF!"}}]
[2,{"$f":"N5","v":{"$error":"#REF!"}},{"$error":"#REF!"},{"$f":"SUM(B6:C6)","v":{"$error":"#REF!"}},null,null,null,{"$f":"SUM(F6:G6)","v":0},null,null,{"$f":"#REF!","v":{"$error":"#REF!"}},{"$f":"'9-10-MDM&EGG'!#REF!","v":{"$error":"#REF!"}},{"$f":"SUM(K6:L6)","v":{"$error":"#REF!"}},{"$f":"B6+F6-K6","v":{"$error":"#REF!"}},{"$f":"C6+G6-L6","v":{"$error":"#REF!"}},{"$f":"SUM(N6:O6)","v":{"$error":"#REF!"}}]
[3,{"$error":"#REF!"},{"$error":"#REF!"},{"$f":"SUM(B7:C7)","v":{"$error":"#REF!"}},null,null,null,0,null,null,{"$f":"#REF!","v":{"$error":"#REF!"}},{"$f":"'9-10-MDM&EGG'!#REF!","v":{"$error":"#REF!"}},{"$error":"#REF!"},{"$f":"B7+F7-K7","v":{"$error":"#REF!"}},{"$error":"#REF!"},{"$error":"#REF!"}]
[4,{"$error":"#REF!"},{"$error":"#REF!"},{"$error":"#REF!"},null,null,null,0,null,null,{"$f":"#REF!","v":{"$error":"#REF!"}},{"$f":"'9-10-MDM&EGG'!#REF!","v":{"$error":"#REF!"}},{"$error":"#REF!"},{"$error":"#REF!"},{"$error":"#REF!"},{"$error":"#REF!"}]
[5,{"$error":"#REF!"},{"$error":"#REF!"},{"$error":"#REF!"},null,null,null,0,null,null,{"$f":"#REF!","v":{"$error":"#REF!"}},{"$f":"'9-10-MDM&EGG'!#REF!","v":{"$error":"#REF!"}},{"$error":"#REF!"},{"$error":"#REF!"},{"$error":"#REF!"},{"$error":"#REF!"}]
[6,{"$error":"#REF!"},{"$error":"#REF!"},{"$error":"#REF!"},null,null,null,0,null,null,{"$f":"#REF!","v":{"$error":"#REF!"}},{"$f":"'9-10-MDM&EGG'!#REF!","v":{"$error":"#REF!"}},{"$error":"#REF!"},{"$error":"#REF!"},{"$error":"#REF!"},{"$error":"#REF!"}]
[7,{"$error":"#REF!"},{"$error":"#REF!"},{"$error":"#REF!"},null,null,null,0,null,null,{"$f":"#REF!","v":{"$error":"#REF!"}},{"$f":"'9-10-MDM&EGG'!#REF!","v":{"$error":"#REF!"}},{"$error":"#REF!"},{"$error":"#REF!"},{"$error":"#REF!"},{"$error":"#REF!"}]
[8,{"$error":"#REF!"},{"$error":"#REF!"},{"$error":"#REF!"},null,null,null,0,null,null,{"$f":"#REF!","v":{"$error":"#REF!"}},{"$f":"'9-10-MDM&EGG'!#REF!","v":{"$error":"#REF!"}},{"$error":"#REF!"},{"$error":"#REF!"},{"$error":"#REF!"},{"$error":"#REF!"}]
[9,{"$error":"#REF!"},{"$error":"#REF!"},{"$error":"#REF!"},null,null,null,0,null,null,{"$f":"#REF!","v":{"$error":"#REF!"}},{"$f":"'9-10-MDM&EGG'!#REF!","v":{"$error":"#REF!"}},{"$error":"#REF!"},{"$error":"#REF!"},{"$error":"#REF!"},{"$error":"#REF!"}]
[10,{"$error":"#REF!"},{"$error":"#REF!"},{"$error":"#REF!"},null,null,null,0,null,null,{"$f":"#REF!","v":{"$error":"#REF!"}},{"$f":"'9-10-MDM&EGG'!#REF!","v":{"$error":"#REF!"}},{"$error":"#REF!"},{"$error":"#REF!"},{"$error":"#REF!"},{"$error":"#REF!"}]
[11,{"$error":"#REF!"},{"$error":"#REF!"},{"$error":"#REF!"},null,null,null,0,null,null,{"$f":"#REF!","v":{"$error":"#REF!"}},{"$f":"'9-10-MDM&EGG'!#REF!","v":{"$error":"#REF!"}},{"$error":"#REF!"},{"$error":"#REF!"},{"$error":"#REF!"},{"$error":"#REF!"}]
[12,{"$error":"#REF!"},{"$error":"#REF!"},{"$error":"#REF!"},null,null,null,0,null,null,{"$f":"#REF!","v":{"$error":"#REF!"}},{"$f":"'9-10-MDM&EGG'!#REF!","v":{"$error":"#REF!"}},{"$error":"#REF!"},{"$error":"#REF!"},{"$error":"#REF!"},{"$error":"#REF!"}]
[13,{"$error":"#REF!"},{"$error":"#REF!"},{"$error":"#REF!"},null,null,null,0,null,null,{"$f":"#REF!","v":{"$error":"#REF!"}},{"$f":"'9-10-MDM&EGG'!#REF!","v":{"$error":"#REF!"}},{"$error":"#REF!"},{"$error":"#REF!"},{"$error":"#REF!"},{"$error":"#REF!"}]
[14,{"$error":"#REF!"},{"$error":"#REF!"},{"$error":"#REF!"},null,null,null,0,null,null,{"$f":"#REF!","v":{"$error":"#REF!"}},{"$f":"'9-10-MDM&EGG'!#REF!","v":{"$error":"#REF!"}},{"$error":"#REF!"},{"$error":"#REF!"},{"$error":"#REF!"},{"$error":"#REF!"}]
[15,{"$error":"#REF!"},{"$error":"#REF!"},{"$error":"#REF!"},null,null,null,0,null,null,{"$f":"#REF!","v":{"$error":"#REF!"}},{"$f":"'9-10-MDM&EGG'!#REF!","v":{"$error":"#REF!"}},{"$error":"#REF!"},{"$error":"#REF!"},{"$error":"#REF!"},{"$error":"#REF!"}]
[16,{"$error":"#REF!"},{"$error":"#REF!"},{"$error":"#REF!"},null,null,null,0,null,null,{"$f":"#REF!","v":{"$error":"#REF!"}},{"$f":"'9-10-MDM&EGG'!#REF!","v":{"$error":"#REF!"}},{"$error":"#REF!"},{"$error":"#REF!"},{"$error":"#REF!"},{"$error":"#REF!"}]
[17,{"$error":"#REF!"},{"$error":"#REF!"},{"$error":"#REF!"},null,null,null,0,null,null,{"$f":"#REF!","v":{"$error":"#REF!"}},{"$f":"'9-10-MDM&EGG'!#REF!","v":{"$error":"#REF!"}},{"$error":"#REF!"},{"$error":"#REF!"},{"$error":"#REF!"},{"$error":"#REF!"}]
[18,{"$f":"N21","v":{"$error":"#REF!"}},{"$error":"#REF!"},{"$error":"#REF!"},null,null,null,0,null,null,{"$f":"#REF!","v":{"$error":"#REF!"}},{"$f":"'9-10-MDM&EGG'!#REF!","v":{"$error":"#REF!"}},{"$error":"#REF!"},{"$error":"#REF!"},{"$error":"#REF!"},{"$error":"#REF!"}]
[19,{"$error":"#REF!"},{"$error":"#REF!"},{"$error":"#REF!"},null,null,null,0,null,null,{"$f":"#REF!","v":{"$error":"#REF!"}},{"$f":"'9-10-MDM&EGG'!#REF!","v":{"$error":"#REF!"}},{"$error":"#REF!"},{"$error":"#REF!"},{"$error":"#REF!"},{"$error":"#REF!"}]
[20,{"$error":"#REF!"},{"$error":"#REF!"},{"$error":"#REF!"},null,null,null,0,null,null,{"$f":"#REF!","v":{"$error":"#REF!"}},{"$f":"'9-10-MDM&EGG'!#REF!","v":{"$error":"#REF!"}},{"$error":"#REF!"},{"$error":"#REF!"},{"$error":"#REF!"},{"$error":"#REF!"}]
[21,{"$error":"#REF!"},{"$error":"#REF!"},{"$error":"#REF!"},null,null,null,0,null,null,{"$f":"#REF!","v":{"$error":"#REF!"}},{"$f":"'9-10-MDM&EGG'!#REF!","v":{"$error":"#REF!"}},{"$error":"#REF!"},{"$error":"#REF!"},{"$error":"#REF!"},{"$error":"#REF!"}]
[22,{"$error":"#REF!"},{"$error":"#REF!"},{"$error":"#REF!"},null,null,null,0,null,null,{"$f":"#REF!","v":{"$error":"#REF!"}},{"$f":"'9-10-MDM&EGG'!#REF!","v":{"$error":"#REF!"}},{"$error":"#REF!"},{"$error":"#REF!"},{"$error":"#REF!"},{"$error":"#REF!"}]
[23,{"$error":"#REF!"},{"$error":"#REF!"},{"$error":"#REF!"},null,null,null,0,null,null,{"$f":"#REF!","v":{"$error":"#REF!"}},{"$f":"'9-10-MDM&EGG'!#REF!","v":{"$error":"#REF!"}},{"$error":"#REF!"},{"$error":"#REF!"},{"$error":"#REF!"},{"$error":"#REF!"}]
[24,{"$error":"#REF!"},{"$error":"#REF!"},{"$error":"#REF!"},null,null,null,0,null,null,{"$f":"#REF!","v":{"$error":"#REF!"}},{"$f":"'9-10-MDM&EGG'!#REF!","v":{"$error":"#REF!"}},{"$error":"#REF!"},{"$error":"#REF!"},{"$error":"#REF!"},{"$error":"#REF!"}]
[25,{"$error":"#REF!"},{"$error":"#REF!"},{"$error":"#REF!"},null,null,null,0,null,null,{"$f":"#REF!","v":{"$error":"#REF!"}},{"$f":"'9-10-MDM&EGG'!#REF!","v":{"$error":"#REF!"}},{"$error":"#REF!"},{"$error":"#REF!"},{"$error":"#REF!"},{"$error":"#REF!"}]
[26,{"$error":"#REF!"},{"$error":"#REF!"},{"$error":"#REF!"},null,null,null,0,null,null,{"$f":"#REF!","v":{"$error":"#REF!"}},{"$f":"'9-10-MDM&EGG'!#REF!","v":{"$error":"#REF!"}},{"$error":"#REF!"},{"$error":"#REF!"},{"$error":"#REF!"},{"$error":"#REF!"}]
[27,{"$error":"#REF!"},{"$error":"#REF!"},{"$error":"#REF!"},null,null,null,0,null,null,{"$f":"#REF!","v":{"$error":"#REF!"}},{"$f":"'9-10-MDM&EGG'!#REF!","v":{"$error":"#REF!"}},{"$error":"#REF!"},{"$error":"#REF!"},{"$error":"#REF!"},{"$error":"#REF!"}]
[28,{"$error":"#REF!"},{"$error":"#REF!"},{"$error":"#REF!"},null,null,null,0,null,null,{"$f":"#REF!","v":{"$error":"#REF!"}},{"$f":"'9-10-MDM&EGG'!#REF!","v":{"$error":"#REF!"}},{"$error":"#REF!"},{"$error":"#REF!"},{"$error":"#REF!"},{"$error":"#REF!"}]
[29,{"$error":"#REF!"},{"$error":"#REF!"},{"$error":"#REF!"},null,null,null,0,null,null,{"$f":"#REF!","v":{"$error":"#REF!"}},{"$f":"'9-10-MDM&EGG'!#REF!","v":{"$error":"#REF!"}},{"$error":"#REF!"},{"$error":"#REF!"},{"$error":"#REF!"},{"$error":"#REF!"}]
[30,{"$error":"#REF!"},{"$error":"#REF!"},{"$error":"#REF!"},null,null,null,0,null,null,{"$f":"#REF!","v":{"$error":"#REF!"}},{"$f":"'9-10-MDM&EGG'!#REF!","v":{"$error":"#REF!"}},{"$error":"#REF!"},{"$error":"#REF!"},{"$error":"#REF!"},{"$error":"#REF!"}]
[31,{"$error":"#REF!"},{"$error":"#REF!"},{"$error":"#REF!"},null,null,null,0,null,null,{"$f":"#REF!","v":{"$error":"#REF!"}},{"$f":"'9-10-MDM&EGG'!#REF!","v":{"$error":"#REF!"}},{"$error":"#REF!"},{"$error":"#REF!"},{"$error":"#REF!"},{"$error":"#REF!"}]
[null,null,null,null,null,{"$f":"SUM(F5:F35)","v":0},{"$f":"SUM(G5:G35)","v":0},{"$f":"SUM(F36:G36)","v":0},null,null,{"$f":"SUM(K5:K35)","v":{"$error":"#REF!"}},{"$f":"SUM(L5:L35)","v":{"$error":"#REF!"}},{"$f":"SUM(K36:L36)","v":{"$error":"#REF!"}}]

{"sheet":"9-10-BKP","index":12,"n_rows":46,"n_cols":23,"rows_kept":46,"cut":false,"hidden":true,"merged":[[41,14,41,16],[39,3,39,5],[39,6,39,8],[39,9,39,11],[39,12,39,15],[40,0,40,2],[40,3,40,5],[40,6,40,8],[40,9,40,11],[40,12,40,15],[39,0,39,2],[25,1,25,2],[26,1,26,2],[27,1,27,2],[28,1,28,2],[29,1,29,2],[30,1,30,2],[31,1,31,2],[32,1,32,2],[33,1,33,2],[34,1,34,2],[35,1,35,2],[24,1,24,2],[13,1,13,2],[14,1,14,2],[15,1,15,2],[16,1,16,2],[17,1,17,2],[18,1,18,2],[19,1,19,2],[20,1,20,2],[21,1,21,2],[22,1,22,2],[23,1,23,2],[12,1,12,2],[3,12,4,12],[3,13,4,13],[3,14,3,16],[3,17,4,17],[5,1,5,2],[6,1,6,2],[7,1,7,2],[8,1,8,2],[9,1,9,2],[10,1,10,2],[11,1,11,2],[0,0,0,16],[1,14,1,17],[2,10,2,12],[2,13,2,17],[3,0,4,0],[3,1,3,3],[3,4,4,4],[3,5,3,7],[3,8,4,8],[3,9,3,11]]}
["MID-DAY MEALS PROGRAMME",null,null,null,null,null,null,null,null,null,null,null,null,null,null,null,null,"HS"]
["MANDAL :",null,{"$f":"MANDAL","v":"XYZ"},null,"SCHOOL :",null,{"$f":"SCHOOL","v":"ZPHS ABC"},null,null,null,null,null,"MONTH :",null,{"$f":"MONTH","v":"2020-01-01"},null,null,null,null,null,null,"BALANCE",{"$f":"'PRIMARY INFORMATION'!$C$11","v":110}]
["NAME OF THE IA :",null,null,null,{"$f":"GROUP","v":"ABCDEF"},null,null,null,null,null,"A/c No.:",null,null,{"$f":"ACCNO","v":1324678911}]
["DAY","No. of Children Enrolled",null,null,"TOTAL","No. of Children attended",null,null,"TOTAL","No. of Children Feeded",null,null,"TOTAL","COST  \nPER CHILD","Net Amount",null,null,"TOTAL",null,null,"RISE USED","RICE BALANCE","RICE RECEIVED"]
[null,"1 TO 5","6 TO 8",null,null,"1 TO 5","6 TO 8",null,null,"1 TO 5","6 TO 8",null,null,null,"1 TO 5","6 TO 8","9 TO 10"]
[{"$f":"#REF!","v":{"$error":"#REF!"}},{"$f":"IF(LEN(#REF!)=0,\"\",#REF!)","v":{"$error":"#REF!"}},null,159,{"$f":"SUM(B6:D6)","v":{"$error":"#REF!"}},null,null,null,{"$f":"SUM(F6:H6)","v":0},null,null,null,{"$f":"SUM(J6:L6)","v":0},6,null,null,{"$f":"M6*N6","v":0},{"$f":"SUM(O6:Q6)","v":0},null,null,{"$f":"M6*150/1000","v":0},{"$f":"($W$2)-U6","v":110}]
[{"$f":"#REF!","v":{"$error":"#REF!"}},{"$f":"IF(LEN(#REF!)=0,\"\",#REF!)","v":{"$error":"#REF!"}},null,{"$f":"D6","v":159},{"$f":"SUM(B7:D7)","v":{"$error":"#REF!"}},null,null,null,{"$f":"SUM(F7:H7)","v":0},null,null,null,{"$f":"SUM(J7:L7)","v":0},6,null,null,{"$f":"M7*N7","v":0},{"$f":"SUM(O7:Q7)","v":0},null,null,{"$f":"M7*150/1000","v":0},{"$f":"(V6+W6)-U7","v":110}]
[{"$f":"#REF!","v":{"$error":"#REF!"}},{"$f":"IF(LEN(#REF!)=0,\"\",#REF!)","v":{"$error":"#REF!"}},null,{"$f":"D7","v":159},{"$error":"#REF!"},null,null,null,0,null,null,null,0,6,null,null,{"$f":"M8*N8","v":0},{"$f":"SUM(O8:Q8)","v":0},null,null,0,{"$f":"(V7+W7)-U8","v":110}]
[{"$f":"#REF!","v":{"$error":"#REF!"}},{"$f":"IF(LEN(#REF!)=0,\"\",#REF!)","v":{"$error":"#REF!"}},null,159,{"$error":"#REF!"},null,null,null,0,null,null,null,0,6,null,null,0,{"$f":"SUM(O9:Q9)","v":0},null,null,0,110]
[{"$f":"#REF!","v":{"$error":"#REF!"}},{"$f":"IF(LEN(#REF!)=0,\"\",#REF!)","v":{"$error":"#REF!"}},null,159,{"$error":"#REF!"},null,null,null,0,null,null,null,0,6,null,null,0,{"$f":"SUM(O10:Q10)","v":0},null,null,0,110]
[{"$f":"#REF!","v":{"$error":"#REF!"}},{"$f":"IF(LEN(#REF!)=0,\"\",#REF!)","v":{"$error":"#REF!"}},null,159,{"$error":"#REF!"},null,null,null,0,null,null,null,0,6,null,null,0,0,null,null,0,110]
[{"$f":"#REF!","v":{"$error":"#REF!"}},{"$f":"IF(LEN(#REF!)=0,\"\",#REF!)","v":{"$error":"#REF!"}},null,159,{"$error":"#REF!"},null,null,null,0,null,null,null,0,6,null,null,0,0,null,null,0,110]
[{"$f":"#REF!","v":{"$error":"#REF!"}},{"$f":"IF(LEN(#REF!)=0,\"\",#REF!)","v":{"$error":"#REF!"}},null,159,{"$error":"#REF!"},null,null,null,0,null,null,null,0,6,null,null,0,0,null,null,0,110]
[{"$f":"#REF!","v":{"$error":"#REF!"}},{"$f":"IF(LEN(#REF!)=0,\"\",#REF!)","v":{"$error":"#REF!"}},null,159,{"$error":"#REF!"},null,null,null,0,null,null,null,0,6,null,null,0,0,null,null,0,110]
[{"$f":"#REF!","v":{"$error":"#REF!"}},{"$f":"IF(LEN(#REF!)=0,\"\",#REF!)","v":{"$error":"#REF!"}},null,159,{"$error":"#REF!"},null,null,null,0,null,null,null,0,6,null,null,0,0,null,null,0,110]
[{"$f":"#REF!","v":{"$error":"#REF!"}},{"$f":"IF(LEN(#REF!)=0,\"\",#REF!)","v":{"$error":"#REF!"}},null,159,{"$error":"#REF!"},null,null,null,0,null,null,null,0,6,null,null,0,0,null,null,0,110]
[{"$f":"#REF!","v":{"$error":"#REF!"}},{"$f":"IF(LEN(#REF!)=0,\"\",#REF!)","v":{"$error":"#REF!"}},null,159,{"$error":"#REF!"},null,null,null,0,null,null,null,0,6,null,null,0,0,null,null,0,110]
[{"$f":"#REF!","v":{"$error":"#REF!"}},{"$f":"IF(LEN(#REF!)=0,\"\",#REF!)","v":{"$error":"#REF!"}},null,159,{"$error":"#REF!"},null,null,null,0,null,null,null,0,6,null,null,0,0,null,null,0,110]
[{"$f":"#REF!","v":{"$error":"#REF!"}},{"$f":"IF(LEN(#REF!)=0,\"\",#REF!)","v":{"$error":"#REF!"}},null,159,{"$error":"#REF!"},null,null,null,0,null,null,null,0,6,null,null,0,0,null,null,0,110]
[{"$f":"#REF!","v":{"$error":"#REF!"}},{"$f":"IF(LEN(#REF!)=0,\"\",#REF!)","v":{"$error":"#REF!"}},null,159,{"$error":"#REF!"},null,null,null,0,null,null,null,0,6,null,null,0,0,null,null,0,110]
[{"$f":"#REF!","v":{"$error":"#REF!"}},{"$f":"IF(LEN(#REF!)=0,\"\",#REF!)","v":{"$error":"#REF!"}},null,159,{"$error":"#REF!"},null,null,null,0,null,null,null,0,6,null,null,0,0,null,null,0,110]
[{"$f":"#REF!","v":{"$error":"#REF!"}},{"$f":"IF(LEN(#REF!)=0,\"\",#REF!)","v":{"$error":"#REF!"}},null,159,{"$error":"#REF!"},null,null,null,0,null,null,null,0,6,null,null,0,0,null,null,0,110]
[{"$f":"#REF!","v":{"$error":"#REF!"}},{"$f":"IF(LEN(#REF!)=0,\"\",#REF!)","v":{"$error":"#REF!"}},null,159,{"$error":"#REF!"},null,null,null,0,null,null,null,0,6,null,null,0,0,null,null,0,110]
[{"$f":"#REF!","v":{"$error":"#REF!"}},{"$f":"IF(LEN(#REF!)=0,\"\",#REF!)","v":{"$error":"#REF!"}},null,159,{"$error":"#REF!"},null,null,null,0,null,null,null,0,6,null,null,0,0,null,null,0,110]
[{"$f":"#REF!","v":{"$error":"#REF!"}},{"$f":"IF(LEN(#REF!)=0,\"\",#REF!)","v":{"$error":"#REF!"}},null,159,{"$error":"#REF!"},null,null,null,0,null,null,null,0,6,null,null,0,0,null,null,0,110]
[{"$f":"#REF!","v":{"$error":"#REF!"}},{"$f":"IF(LEN(#REF!)=0,\"\",#REF!)","v":{"$error":"#REF!"}},null,159,{"$error":"#REF!"},null,null,null,0,null,null,null,0,6,null,null,0,0,null,null,0,110]
[{"$f":"#REF!","v":{"$error":"#REF!"}},{"$f":"IF(LEN(#REF!)=0,\"\",#REF!)","v":{"$error":"#REF!"}},null,159,{"$error":"#REF!"},null,null,null,0,null,null,null,0,6,null,null,0,0,null,null,0,110]
[{"$f":"#REF!","v":{"$error":"#REF!"}},{"$f":"IF(LEN(#REF!)=0,\"\",#REF!)","v":{"$error":"#REF!"}},null,159,{"$error":"#REF!"},null,null,null,0,null,null,null,0,6,null,null,0,0,null,null,0,110]
[{"$f":"#REF!","v":{"$error":"#REF!"}},{"$f":"IF(LEN(#REF!)=0,\"\",#REF!)","v":{"$error":"#REF!"}},null,159,{"$error":"#REF!"},null,null,null,0,null,null,null,0,6,null,null,0,0,null,null,0,110]
[{"$f":"#REF!","v":{"$error":"#REF!"}},{"$f":"IF(LEN(#REF!)=0,\"\",#REF!)","v":{"$error":"#REF!"}},null,159,{"$error":"#REF!"},null,null,null,0,null,null,null,0,6,null,null,0,0,null,null,0,110]
[{"$f":"#REF!","v":{"$error":"#REF!"}},{"$f":"IF(LEN(#REF!)=0,\"\",#REF!)","v":{"$error":"#REF!"}},null,159,{"$error":"#REF!"},null,null,null,0,null,null,null,0,6,null,null,0,0,null,null,0,110]
[{"$f":"#REF!","v":{"$error":"#REF!"}},{"$f":"IF(LEN(#REF!)=0,\"\",#REF!)","v":{"$error":"#REF!"}},null,159,{"$error":"#REF!"},null,null,null,0,null,null,null,0,6,null,null,0,0,null,null,0,110]
[{"$f":"#REF!","v":{"$error":"#REF!"}},{"$f":"IF(LEN(#REF!)=0,\"\",#REF!)","v":{"$error":"#REF!"}},null,159,{"$error":"#REF!"},null,null,null,0,null,null,null,0,6,null,null,0,0,null,null,0,110]
[{"$f":"#REF!","v":{"$error":"#REF!"}},{"$f":"IF(LEN(#REF!)=0,\"\",#REF!)","v":{"$error":"#REF!"}},null,159,{"$error":"#REF!"},null,null,null,0,null,null,null,0,6,null,null,0,0,null,null,0,110]
[{"$f":"#REF!","v":{"$error":"#REF!"}},{"$f":"IF(LEN(#REF!)=0,\"\",#REF!)","v":{"$error":"#REF!"}},null,159,{"$error":"#REF!"},null,null,null,0,null,null,null,0,6,null,null,0,0,null,null,0,110]
[{"$f":"#REF!","v":{"$error":"#REF!"}},{"$f":"IF(LEN(#REF!)=0,\"\",#REF!)","v":{"$error":"#REF!"}},null,159,{"$error":"#REF!"},null,null,null,0,null,null,null,0,6,null,null,0,0,null,null,0,110]
["Total",null,null,null,null,null,null,null,{"$f":"SUM(I6:I36)","v":0},null,null,null,{"$f":"SUM(M6:M36)","v":0},6,null,null,{"$f":"SUM(Q6:Q36)","v":0},{"$f":"SUM(R6:R36)","v":0},null,null,0,110]
[null,null,null,null,null,null,null,null,null,null,null,null,null,null,null,null,{"$f":"ROUND(R37,0)","v":0}]
["Rice Account"]
["Opening Balance",null,null,"Received during Month",null,null,"Total Rice",null,null,"Utilised during Month",null,null,"Balance Rice",null,null,null,"No. of Children Took MDM"]
[{"$f":"W2","v":110},null,null,{"$f":"'RICE ACCOUNT'!$G$37","v":0},null,null,{"$f":"SUM(A41:F41)","v":110},null,null,{"$f":"U37","v":0},null,null,{"$f":"G41-J41","v":110}]
[null,"No. of Children took MDM  :",null,null,null,null,null,{"$f":"$M$37","v":0},null,"Total Amount(Rounded):Rs.",null,null,null,null,{"$f":"$Q$38","v":0}]
["Sign. Of the Implementing Agency",null,null,null,null,null,null,null,null,null,null,null,null,"Sign. Of the Head Master"]
[]
[]
[null,null,null,null,null,null,null,"Mandal Educational Officer"]

{"sheet":"QUARTERLY","index":13,"n_rows":36,"n_cols":4,"rows_kept":36,"cut":false,"hidden":true,"merged":[[21,0,21,3],[0,0,0,1],[0,2,0,3],[4,0,4,3],[11,0,11,3],[12,2,12,3],[13,2,13,3],[14,2,14,3],[16,0,16,3],[17,2,17,3],[18,2,18,3],[19,2,19,3],[35,2,35,3],[22,2,22,3],[23,2,23,3],[24,2,24,3],[26,0,26,3],[27,2,27,3],[28,2,28,3],[29,2,29,3],[31,0,31,3],[32,2,32,3],[33,2,33,3],[34,2,34,3]]}
["School Level Health Data for",null,"(Feb-15, Mar-15 & April-15)"]
["Instructions:"]
["1.Keep Enrollment Register at the time of entry"]
["2.Keep Account Register at the time of entry"]
["School Details"]
["School Code",1508611,"School Name","ZPHS GUNDLA POCHAMPALLY"]
["School Type","ZP(LOCAL BODIES)","Category","HIGH SCHOOL"]
["State","ANDHRA PRADESH","District","RANGA REDDY"]
["Area","LAXMINAGAR","Block","MEDCHAL"]
["Village/Ward","GUNDLAPOCHAMPALLY"]
[]
["Number of Children weight measured"]
[null,"Primary","Upper Primary"]
["Boys",null,102]
["Girls",null,117]
[]
["Number of Children height measured"]
[null,"Primary","Upper Primary"]
["Boys",null,{"$f":"C14","v":102}]
["Girls",null,{"$f":"C15","v":117}]
[]
["Number of children with refractive errors"]
[null,"Primary","Upper Primary"]
["Number of Children diagnosed with\nrefractive errors",null,32]
["Number of Children provided\nspectacles",null,0]
[]
["Number of Children with Health Problems detected during School Health Checkup"]
[null,"Primary","Upper Primary"]
["Number of Children Problems treated\nduring School Health Checkup",null,0]
["Number of Children Problems detected\nduring School Health Checkup and were referred",null,0]
[]
["Distribution of Iron & Folic Acid, Deworming, Vitamin-A supplementation"]
[null,"Primary","Upper Primary"]
["Number of Children received weekly\nIron and Folic acid tablets in the last 3 months",null,0]
["Number of children received\ndeworming tablets",null,0]
["Number of children received Vitamin-A\nsupplementation",null,0]

{"sheet":"UPSBILL","index":14,"n_rows":25,"n_cols":7,"rows_kept":25,"cut":false,"hidden":true,"merged":[[19,0,19,3],[1,0,1,4],[2,0,2,4],[20,1,21,4]]}
[]
[{"$f":"\"MID-DAY MEALS VOUCHER FOR THE MONTH OF \" & MONTH","v":"MID-DAY MEALS VOUCHER FOR THE MONTH OF 43831"}]
[{"$f":"SCHOOL","v":"ZPHS ABC"},null,null,null,null,null,{"$f":"#REF!","v":{"$error":"#REF!"}}]
[]
["SLNO","ITEM","RATE","QUANTITY","AMOUNT"]
[1,"కందిపప్పు",125,24,{"$f":"C6*D6","v":3000}]
[2,"చింతపండు",100,8,{"$f":"C7*D7","v":800}]
[3,"మంచినూనె",110,11,1210]
[4,"ఉప్పు ప్యాకెట్",14,10,140]
[5,"కారం",200,3,600]
[6,"పసుపు",225,1,225]
[7,"ఆవాలు",100,2,200]
[8,"జిలకర",250,2,500]
[9,"ఎండుమిర్చి",80,2,160]
[10,"సాంబార్ పొడి ప్యాకెట్స్",30,10,300]
[11,"అల్లం, వెల్లుల్ల్లి",50,5,250]
[12,"కూరగాయలు",1200,1,1200]
[13,"గుడ్లు",4,420,1680]
[14,"కట్టెలు",1000,1,1000]
["TOTAL",null,null,null,{"$f":"SUM(E6:E19)","v":11265}]
[null,{"$f":"rswords(E20)","v":"Rupees Eleven Thousand Two Hundred Sixty Five Only"}]
[]
[]
[]
["Signature of the IA",null,null,"Head Master"]

{"sheet":"HSSBILL","index":15,"n_rows":25,"n_cols":13,"rows_kept":25,"cut":false,"hidden":true,"merged":[[18,0,18,3],[0,0,0,4],[1,0,1,4],[19,0,20,4],[3,5,3,7]]}
[{"$f":"\"MID-DAY MEALS VOUCHER FOR THE MONTH OF \" & MONTH","v":"MID-DAY MEALS VOUCHER FOR THE MONTH OF 43831"}]
[{"$f":"SCHOOL","v":"ZPHS ABC"}]
[null,null,null,null,null,null,null,{"$f":"'9-10-MDM&EGG'!$H$37","v":0}]
["SLNO","ITEM","RATE","QUANTITY","AMOUNT",{"$f":"UPSBILL!C5","v":"RATE"}]
[1,"కందిపప్పు",125,15,{"$f":"C5*D5","v":1875},null,null,null,null,null,{"$f":"UPSBILL!C5","v":"RATE"},{"$f":"UPSBILL!D5","v":"QUANTITY"},{"$f":"UPSBILL!E5","v":"AMOUNT"}]
[2,"చింతపండు",100,5,{"$f":"C6*D6","v":500},null,null,null,null,null,{"$f":"UPSBILL!C6","v":125},{"$f":"UPSBILL!D6","v":24},{"$f":"UPSBILL!E6","v":3000}]
[3,"మంచినూనె",110,5,550,null,null,null,null,null,{"$f":"UPSBILL!C7","v":100},{"$f":"UPSBILL!D7","v":8},{"$f":"UPSBILL!E7","v":800}]
[4,"ఉప్పు ప్యాకెట్",14,8,112,null,null,null,null,null,{"$f":"UPSBILL!C8","v":110},{"$f":"UPSBILL!D8","v":11},{"$f":"UPSBILL!E8","v":1210}]
[5,"కారం",200,1,200,null,null,null,null,null,{"$f":"UPSBILL!C9","v":14},{"$f":"UPSBILL!D9","v":10},{"$f":"UPSBILL!E9","v":140}]
[6,"పసుపు",225,1,225,null,null,null,null,null,{"$f":"UPSBILL!C10","v":200},{"$f":"UPSBILL!D10","v":3},{"$f":"UPSBILL!E10","v":600}]
[7,"ఆవాలు",100,1,100,null,null,null,null,null,{"$f":"UPSBILL!C11","v":225},{"$f":"UPSBILL!D11","v":1},{"$f":"UPSBILL!E11","v":225}]
[8,"జిలకర",250,1,250,null,null,null,null,null,{"$f":"UPSBILL!C12","v":100},{"$f":"UPSBILL!D12","v":2},{"$f":"UPSBILL!E12","v":200}]
[9,"ఎండుమిర్చి",80,1,80,null,null,null,null,null,{"$f":"UPSBILL!C13","v":250},{"$f":"UPSBILL!D13","v":2},{"$f":"UPSBILL!E13","v":500}]
[10,"సాంబార్ పొడి ప్యాకెట్స్",30,10,300,null,null,null,null,null,{"$f":"UPSBILL!C14","v":80},{"$f":"UPSBILL!D14","v":2},{"$f":"UPSBILL!E14","v":160}]
[11,"అల్లం, వెల్లుల్ల్లి",50,2,100,null,null,null,null,null,{"$f":"UPSBILL!C15","v":30},{"$f":"UPSBILL!D15","v":10},{"$f":"UPSBILL!E15","v":300}]
[12,"కూరగాయలు",1000,1,1000,null,null,null,null,null,{"$f":"UPSBILL!C16","v":50},{"$f":"UPSBILL!D16","v":5},{"$f":"UPSBILL!E16","v":250}]
[13,"గుడ్లు",4,300,1200,null,null,null,null,null,{"$f":"UPSBILL!C17","v":1200},{"$f":"UPSBILL!D17","v":1},{"$f":"UPSBILL!E17","v":1200}]
[14,"కట్టెలు",1000,1,1000,null,null,null,null,null,{"$f":"UPSBILL!C18","v":4},{"$f":"UPSBILL!D18","v":420},{"$f":"UPSBILL!E18","v":1680}]
["TOTAL",null,null,null,{"$f":"SUM(E5:E18)","v":7492},null,null,null,null,null,{"$f":"UPSBILL!C19","v":1000},{"$f":"UPSBILL!D19","v":1},{"$f":"UPSBILL!E19","v":1000}]
[{"$f":"rswords(E19)","v":"Rupees Seven Thousand Four Hundred Ninety Two Only"}]
[]
[]
[]
[]
["Signature of the IA",null,null,"Head Master"]

{"sheet":"RICE BALANC","index":16,"n_rows":12,"n_cols":3,"rows_kept":12,"cut":false,"hidden":true,"merged":[[3,0,3,3]]}
[]
[]
[]
["RICE BALANCE ABSTRACT"]
[]
[]
["UPS","HS","TOTAL"]
[{"$f":"'RICE ACCOUNT'!$N$36","v":120},{"$f":"'RICE ACCOUNT'!$O$36","v":110},{"$f":"SUM(A8:B8)","v":230}]
[]
["UPS AMOUNT",{"$f":"#REF!","v":{"$error":"#REF!"}}]
["HS AMOUNT",{"$f":"'9-10-MDM&EGG'!$H$37","v":0}]
["TOTAL AMOUNT",{"$f":"SUM(B10:B11)","v":{"$error":"#REF!"}}]